{"text_format":"1","workbook":"xlsx","n_sheets":3,"sheets":["GLUE CALCULATOR","obliczenia kleju","User Instructions"],"not_rendered":{"charts":0,"images":3,"macros":1,"external_links":0,"defined_names":2,"comments":0,"pivot_tables":0},"unopened":[],"bounds":{"document_bytes":16777216,"sheet_cells":100000,"rows_first":2000,"rows_last":500,"rows_between":2000,"halvings":0,"cell_chars":16384,"cell_head_chars":4096},"cells_cut":0,"cells_raw":0,"read":"whole","date_system":"1900"}

{"sheet":"GLUE CALCULATOR","index":0,"n_rows":486,"n_cols":12,"rows_kept":486,"cut":false,"hidden":false,"merged":[]}
[null,"FIX PRO","pcs.",null,"FIX EXTRA","pcs.",null,"MAX",null,"pcs."]
[null,null,{"$f":"'obliczenia kleju'!L2","v":0},null,null,{"$f":"'obliczenia kleju'!N2","v":0},null,null,null,{"$f":"'obliczenia kleju'!O2","v":0},null,"Poznámka: Lepidlo FIX EXTRA se doporučuje pro všechny spoje mezi produkty Profoam, FLEX a Polyforce. MAX: Záclonové a těžké profily."]
[]
["Nr","Kód produktu","Počet lišt (ks)",null,"Sortiment","Materiál","Výška, \ncm","Šířka, \ncm","Délka, \ncm","Typ montážního lepidla"]
[1,"MD001",null,null,"Podlahové lišty","Polyforce",2.1,2.1,200,{"$f":"VLOOKUP('GLUE CALCULATOR'!B5, 'obliczenia kleju'!$A$5:$B$1060, 2,FALSE)","v":"PRO"}]
[2,"MD004",null,null,"Podlahové lišty","Polyforce",4.9000000000000004,1.5,200,{"$f":"VLOOKUP('GLUE CALCULATOR'!B6, 'obliczenia kleju'!$A$5:$B$1060, 2,FALSE)","v":"PRO"}]
[3,"MD005",null,null,"Podlahové lišty","Polyforce",11,2.2000000000000002,200,{"$f":"VLOOKUP('GLUE CALCULATOR'!B7, 'obliczenia kleju'!$A$5:$B$1060, 2,FALSE)","v":"PRO"}]
[4,"MD006",null,null,"Podlahové lišty","Polyforce",10.1,2.2999999999999998,200,{"$f":"VLOOKUP('GLUE CALCULATOR'!B8, 'obliczenia kleju'!$A$5:$B$1060, 2,FALSE)","v":"PRO"}]
[5,"MD008",null,null,"Podlahové lišty","Polyforce",8,1.7,200,{"$f":"VLOOKUP('GLUE CALCULATOR'!B9, 'obliczenia kleju'!$A$5:$B$1060, 2,FALSE)","v":"PRO"}]
[6,"MD009",null,null,"Podlahové lišty","Polyforce",10,1.7,200,{"$f":"VLOOKUP('GLUE CALCULATOR'!B10, 'obliczenia kleju'!$A$5:$B$1060, 2,FALSE)","v":"PRO"}]
[7,"MD011",null,null,"Podlahové lišty","Polyforce",4,1,200,{"$f":"VLOOKUP('GLUE CALCULATOR'!B11, 'obliczenia kleju'!$A$5:$B$1060, 2,FALSE)","v":"PRO"}]
[8,"MD013",null,null,"Podlahové lišty","Polyforce",10,1,200,{"$f":"VLOOKUP('GLUE CALCULATOR'!B12, 'obliczenia kleju'!$A$5:$B$1060, 2,FALSE)","v":"PRO"}]
[9,"MD014",null,null,"Podlahové lišty","Polyforce",8,1.4,200,{"$f":"VLOOKUP('GLUE CALCULATOR'!B13, 'obliczenia kleju'!$A$5:$B$1060, 2,FALSE)","v":"PRO"}]
[10,"MD016",null,null,"Podlahové lišty","Polyforce",10,2.2999999999999998,200,{"$f":"VLOOKUP('GLUE CALCULATOR'!B14, 'obliczenia kleju'!$A$5:$B$1060, 2,FALSE)","v":"PRO"}]
[11,"MD017",null,null,"Podlahové lišty","Polyforce",6.9,1.4,200,{"$f":"VLOOKUP('GLUE CALCULATOR'!B15, 'obliczenia kleju'!$A$5:$B$1060, 2,FALSE)","v":"PRO"}]
[12,"MD018",null,null,"Podlahové lišty","Polyforce",8,1.3,200,{"$f":"VLOOKUP('GLUE CALCULATOR'!B16, 'obliczenia kleju'!$A$5:$B$1060, 2,FALSE)","v":"PRO"}]
[13,"MD020",null,null,"Podlahové lišty","Polyforce",19.8,1.9,200,{"$f":"VLOOKUP('GLUE CALCULATOR'!B17, 'obliczenia kleju'!$A$5:$B$1060, 2,FALSE)","v":"PRO"}]
[14,"MD024",null,null,"Podlahové lišty","Polyforce",8,2.7,200,{"$f":"VLOOKUP('GLUE CALCULATOR'!B18, 'obliczenia kleju'!$A$5:$B$1060, 2,FALSE)","v":"PRO"}]
[15,"MD025",null,null,"Podlahové lišty","Polyforce",11,2.7,200,{"$f":"VLOOKUP('GLUE CALCULATOR'!B19, 'obliczenia kleju'!$A$5:$B$1060, 2,FALSE)","v":"PRO"}]
[16,"MD027",null,null,"Podlahové lišty","Polyforce",6,1.3,200,{"$f":"VLOOKUP('GLUE CALCULATOR'!B20, 'obliczenia kleju'!$A$5:$B$1060, 2,FALSE)","v":"PRO"}]
[17,"MD028",null,null,"Podlahové lišty","Polyforce",6,1.3,200,{"$f":"VLOOKUP('GLUE CALCULATOR'!B21, 'obliczenia kleju'!$A$5:$B$1060, 2,FALSE)","v":"PRO"}]
[18,"MD030",null,null,"Podlahové lišty","Polyforce",8,1.7,200,{"$f":"VLOOKUP('GLUE CALCULATOR'!B22, 'obliczenia kleju'!$A$5:$B$1060, 2,FALSE)","v":"PRO"}]
[19,"MD032",null,null,"Podlahové lišty","Polyforce",6,1.3,200,{"$f":"VLOOKUP('GLUE CALCULATOR'!B23, 'obliczenia kleju'!$A$5:$B$1060, 2,FALSE)","v":"PRO"}]
[20,"MD057",null,null,"Podlahové lišty","Polyforce",5.7,1.5,200,{"$f":"VLOOKUP('GLUE CALCULATOR'!B24, 'obliczenia kleju'!$A$5:$B$1060, 2,FALSE)","v":"PRO"}]
[21,"MD094",null,null,"Podlahové lišty","Polyforce",9.4,1.2,200,{"$f":"VLOOKUP('GLUE CALCULATOR'!B25, 'obliczenia kleju'!$A$5:$B$1060, 2,FALSE)","v":"PRO"}]
[22,"MD095",null,null,"Podlahové lišty","Polyforce",12,1.5,200,{"$f":"VLOOKUP('GLUE CALCULATOR'!B26, 'obliczenia kleju'!$A$5:$B$1060, 2,FALSE)","v":"PRO"}]
[23,"MD234",null,null,"Podlahové lišty","Polyforce",7.8,1.4,200,{"$f":"VLOOKUP('GLUE CALCULATOR'!B27, 'obliczenia kleju'!$A$5:$B$1060, 2,FALSE)","v":"PRO"}]
[24,"MD235",null,null,"Podlahové lišty","Polyforce",1.8,1.8,200,{"$f":"VLOOKUP('GLUE CALCULATOR'!B28, 'obliczenia kleju'!$A$5:$B$1060, 2,FALSE)","v":"PRO"}]
[25,"MD236",null,null,"Podlahové lišty","Polyforce",9.9,1.3,200,{"$f":"VLOOKUP('GLUE CALCULATOR'!B29, 'obliczenia kleju'!$A$5:$B$1060, 2,FALSE)","v":"PRO"}]
[26,"MD258",null,null,"Podlahové lišty","Polyforce",8.1,1,200,{"$f":"VLOOKUP('GLUE CALCULATOR'!B30, 'obliczenia kleju'!$A$5:$B$1060, 2,FALSE)","v":"PRO"}]
[27,"MD354",null,null,"Podlahové lišty","Polyforce",10.7,1.1000000000000001,200,{"$f":"VLOOKUP('GLUE CALCULATOR'!B31, 'obliczenia kleju'!$A$5:$B$1060, 2,FALSE)","v":"PRO"}]
[28,"MD355",null,null,"Podlahové lišty","Polyforce",9.6999999999999993,1.8,200,{"$f":"VLOOKUP('GLUE CALCULATOR'!B32, 'obliczenia kleju'!$A$5:$B$1060, 2,FALSE)","v":"PRO"}]
[29,"MD356",null,null,"Podlahové lišty","Polyforce",10.8,1.6,200,{"$f":"VLOOKUP('GLUE CALCULATOR'!B33, 'obliczenia kleju'!$A$5:$B$1060, 2,FALSE)","v":"PRO"}]
[30,"MD358",null,null,"Podlahové lišty","Polyforce",11.7,1.4,200,{"$f":"VLOOKUP('GLUE CALCULATOR'!B34, 'obliczenia kleju'!$A$5:$B$1060, 2,FALSE)","v":"PRO"}]
[31,"MD359",null,null,"Podlahové lišty","Polyforce",7,1.6,200,{"$f":"VLOOKUP('GLUE CALCULATOR'!B35, 'obliczenia kleju'!$A$5:$B$1060, 2,FALSE)","v":"PRO"}]
[32,"MD359B",null,null,"Podlahové lišty","Polyforce",7,1.6,200,{"$f":"VLOOKUP('GLUE CALCULATOR'!B36, 'obliczenia kleju'!$A$5:$B$1060, 2,FALSE)","v":"PRO"}]
[33,"MD360",null,null,"Podlahové lišty","Polyforce",13.7,1.8,200,{"$f":"VLOOKUP('GLUE CALCULATOR'!B37, 'obliczenia kleju'!$A$5:$B$1060, 2,FALSE)","v":"PRO"}]
[34,"MD361",null,null,"Podlahové lišty","Polyforce",14.4,1.5,200,{"$f":"VLOOKUP('GLUE CALCULATOR'!B38, 'obliczenia kleju'!$A$5:$B$1060, 2,FALSE)","v":"PRO"}]
[35,"MD363",null,null,"Podlahové lišty","Polyforce",10.6,2.2999999999999998,200,{"$f":"VLOOKUP('GLUE CALCULATOR'!B39, 'obliczenia kleju'!$A$5:$B$1060, 2,FALSE)","v":"PRO"}]
[36,"MD8300",null,null,"Podlahové lišty","Polyforce",8.1999999999999993,2.6,200,{"$f":"VLOOKUP('GLUE CALCULATOR'!B40, 'obliczenia kleju'!$A$5:$B$1060, 2,FALSE)","v":"PRO"}]
[37,"QS003",null,null,"Podlahové lišty","Polyforce",12.8,1.8,200,{"$f":"VLOOKUP('GLUE CALCULATOR'!B41, 'obliczenia kleju'!$A$5:$B$1060, 2,FALSE)","v":"PRO"}]
[38,"QS004",null,null,"Podlahové lišty","Polyforce",10.8,1.5,200,{"$f":"VLOOKUP('GLUE CALCULATOR'!B42, 'obliczenia kleju'!$A$5:$B$1060, 2,FALSE)","v":"PRO"}]
[39,"QS009",null,null,"Podlahové lišty","Polyforce",10,1.6,200,{"$f":"VLOOKUP('GLUE CALCULATOR'!B43, 'obliczenia kleju'!$A$5:$B$1060, 2,FALSE)","v":"PRO"}]
[40,"QS011",null,null,"Podlahové lišty","Polyforce",13.5,4,200,{"$f":"VLOOKUP('GLUE CALCULATOR'!B44, 'obliczenia kleju'!$A$5:$B$1060, 2,FALSE)","v":"PRO"}]
[41,"MD001P",null,null,"Prémiové lišty","Polyforce",2.1,2.1,200,{"$f":"VLOOKUP('GLUE CALCULATOR'!B45, 'obliczenia kleju'!$A$5:$B$1060, 2,FALSE)","v":"PRO"}]
[42,"MD004P",null,null,"Prémiové lišty","Polyforce",4.9000000000000004,1.5,200,{"$f":"VLOOKUP('GLUE CALCULATOR'!B46, 'obliczenia kleju'!$A$5:$B$1060, 2,FALSE)","v":"PRO"}]
[43,"MD005P",null,null,"Prémiové lišty","Polyforce",11,2.2000000000000002,200,{"$f":"VLOOKUP('GLUE CALCULATOR'!B47, 'obliczenia kleju'!$A$5:$B$1060, 2,FALSE)","v":"PRO"}]
[44,"MD006P",null,null,"Prémiové lišty","Polyforce",10.1,2.2999999999999998,200,{"$f":"VLOOKUP('GLUE CALCULATOR'!B48, 'obliczenia kleju'!$A$5:$B$1060, 2,FALSE)","v":"PRO"}]
[45,"MD008P",null,null,"Prémiové lišty","Polyforce",8,1.7,200,{"$f":"VLOOKUP('GLUE CALCULATOR'!B49, 'obliczenia kleju'!$A$5:$B$1060, 2,FALSE)","v":"PRO"}]
[46,"MD009P",null,null,"Prémiové lišty","Polyforce",10,1.7,200,{"$f":"VLOOKUP('GLUE CALCULATOR'!B50, 'obliczenia kleju'!$A$5:$B$1060, 2,FALSE)","v":"PRO"}]
[47,"MD011P",null,null,"Prémiové lišty","Polyforce",4,1,200,{"$f":"VLOOKUP('GLUE CALCULATOR'!B51, 'obliczenia kleju'!$A$5:$B$1060, 2,FALSE)","v":"PRO"}]
[48,"MD013P",null,null,"Prémiové lišty","Polyforce",10,1,200,{"$f":"VLOOKUP('GLUE CALCULATOR'!B52, 'obliczenia kleju'!$A$5:$B$1060, 2,FALSE)","v":"PRO"}]
[49,"MD014P",null,null,"Prémiové lišty","Polyforce",8,1.4,200,{"$f":"VLOOKUP('GLUE CALCULATOR'!B53, 'obliczenia kleju'!$A$5:$B$1060, 2,FALSE)","v":"PRO"}]
[50,"MD016P",null,null,"Prémiové lišty","Polyforce",10,2.2999999999999998,200,{"$f":"VLOOKUP('GLUE CALCULATOR'!B54, 'obliczenia kleju'!$A$5:$B$1060, 2,FALSE)","v":"PRO"}]
[51,"MD017P",null,null,"Prémiové lišty","Polyforce",6.9,1.4,200,{"$f":"VLOOKUP('GLUE CALCULATOR'!B55, 'obliczenia kleju'!$A$5:$B$1060, 2,FALSE)","v":"PRO"}]
[52,"MD018P",null,null,"Prémiové lišty","Polyforce",8,1.3,200,{"$f":"VLOOKUP('GLUE CALCULATOR'!B56, 'obliczenia kleju'!$A$5:$B$1060, 2,FALSE)","v":"PRO"}]
[53,"MD020P",null,null,"Prémiové lišty","Polyforce",19.8,1.9,200,{"$f":"VLOOKUP('GLUE CALCULATOR'!B57, 'obliczenia kleju'!$A$5:$B$1060, 2,FALSE)","v":"PRO"}]
[54,"MD024P",null,null,"Prémiové lišty","Polyforce",8,2.7,200,{"$f":"VLOOKUP('GLUE CALCULATOR'!B58, 'obliczenia kleju'!$A$5:$B$1060, 2,FALSE)","v":"PRO"}]
[55,"MD025P",null,null,"Prémiové lišty","Polyforce",11,2.7,200,{"$f":"VLOOKUP('GLUE CALCULATOR'!B59, 'obliczenia kleju'!$A$5:$B$1060, 2,FALSE)","v":"PRO"}]
[56,"MD027P",null,null,"Prémiové lišty","Polyforce",6,1.3,200,{"$f":"VLOOKUP('GLUE CALCULATOR'!B60, 'obliczenia kleju'!$A$5:$B$1060, 2,FALSE)","v":"PRO"}]
[57,"MD028P",null,null,"Prémiové lišty","Polyforce",6,1.3,200,{"$f":"VLOOKUP('GLUE CALCULATOR'!B61, 'obliczenia kleju'!$A$5:$B$1060, 2,FALSE)","v":"PRO"}]
[58,"MD030P",null,null,"Prémiové lišty","Polyforce",8,1.7,200,{"$f":"VLOOKUP('GLUE CALCULATOR'!B62, 'obliczenia kleju'!$A$5:$B$1060, 2,FALSE)","v":"PRO"}]
[59,"MD032P",null,null,"Prémiové lišty","Polyforce",6,1.3,200,{"$f":"VLOOKUP('GLUE CALCULATOR'!B63, 'obliczenia kleju'!$A$5:$B$1060, 2,FALSE)","v":"PRO"}]
[60,"MD094P",null,null,"Prémiové lišty","Polyforce",9.4,1.2,200,{"$f":"VLOOKUP('GLUE CALCULATOR'!B64, 'obliczenia kleju'!$A$5:$B$1060, 2,FALSE)","v":"PRO"}]
[61,"MD095P",null,null,"Prémiové lišty","Polyforce",12,1.5,200,{"$f":"VLOOKUP('GLUE CALCULATOR'!B65, 'obliczenia kleju'!$A$5:$B$1060, 2,FALSE)","v":"PRO"}]
[62,"MD234P",null,null,"Prémiové lišty","Polyforce",7.8,1.4,200,{"$f":"VLOOKUP('GLUE CALCULATOR'!B66, 'obliczenia kleju'!$A$5:$B$1060, 2,FALSE)","v":"PRO"}]
[63,"MD235P",null,null,"Prémiové lišty","Polyforce",1.8,1.8,200,{"$f":"VLOOKUP('GLUE CALCULATOR'!B67, 'obliczenia kleju'!$A$5:$B$1060, 2,FALSE)","v":"PRO"}]
[64,"MD236P",null,null,"Prémiové lišty","Polyforce",9.9,1.3,200,{"$f":"VLOOKUP('GLUE CALCULATOR'!B68, 'obliczenia kleju'!$A$5:$B$1060, 2,FALSE)","v":"PRO"}]
[65,"MD258P",null,null,"Prémiové lišty","Polyforce",8.1,1,200,{"$f":"VLOOKUP('GLUE CALCULATOR'!B69, 'obliczenia kleju'!$A$5:$B$1060, 2,FALSE)","v":"PRO"}]
[66,"MD354P",null,null,"Prémiové lišty","Polyforce",10.7,1.1000000000000001,200,{"$f":"VLOOKUP('GLUE CALCULATOR'!B70, 'obliczenia kleju'!$A$5:$B$1060, 2,FALSE)","v":"PRO"}]
[67,"MD355P",null,null,"Prémiové lišty","Polyforce",9.6999999999999993,1.8,200,{"$f":"VLOOKUP('GLUE CALCULATOR'!B71, 'obliczenia kleju'!$A$5:$B$1060, 2,FALSE)","v":"PRO"}]
[68,"MD356P",null,null,"Prémiové lišty","Polyforce",10.8,1.6,200,{"$f":"VLOOKUP('GLUE CALCULATOR'!B72, 'obliczenia kleju'!$A$5:$B$1060, 2,FALSE)","v":"PRO"}]
[69,"MD358P",null,null,"Prémiové lišty","Polyforce",11.7,1.4,200,{"$f":"VLOOKUP('GLUE CALCULATOR'!B73, 'obliczenia kleju'!$A$5:$B$1060, 2,FALSE)","v":"PRO"}]
[70,"MD359P",null,null,"Prémiové lišty","Polyforce",7,1.6,200,{"$f":"VLOOKUP('GLUE CALCULATOR'!B74, 'obliczenia kleju'!$A$5:$B$1060, 2,FALSE)","v":"PRO"}]
[71,"MD360P",null,null,"Prémiové lišty","Polyforce",13.7,1.8,200,{"$f":"VLOOKUP('GLUE CALCULATOR'!B75, 'obliczenia kleju'!$A$5:$B$1060, 2,FALSE)","v":"PRO"}]
[72,"MD361P",null,null,"Prémiové lišty","Polyforce",14.4,1.5,200,{"$f":"VLOOKUP('GLUE CALCULATOR'!B76, 'obliczenia kleju'!$A$5:$B$1060, 2,FALSE)","v":"PRO"}]
[73,"MD363P",null,null,"Prémiové lišty","Polyforce",10.6,2.2999999999999998,200,{"$f":"VLOOKUP('GLUE CALCULATOR'!B77, 'obliczenia kleju'!$A$5:$B$1060, 2,FALSE)","v":"PRO"}]
[74,"MD8300P",null,null,"Prémiové lišty","Polyforce",8.1999999999999993,2.6,200,{"$f":"VLOOKUP('GLUE CALCULATOR'!B78, 'obliczenia kleju'!$A$5:$B$1060, 2,FALSE)","v":"PRO"}]
[75,"QL007P",null,null,"Prémiové lišty","Polyforce",9.3000000000000007,4,200,{"$f":"VLOOKUP('GLUE CALCULATOR'!B79, 'obliczenia kleju'!$A$5:$B$1060, 2,FALSE)","v":"PRO"}]
[76,"QL019P",null,null,"Lišty PRO Led osvětlení","Polyforce",8,2.5,200,{"$f":"VLOOKUP('GLUE CALCULATOR'!B80, 'obliczenia kleju'!$A$5:$B$1060, 2,FALSE)","v":"PRO"}]
{"$rows_left_out":407}
{"sheet":"obliczenia kleju","index":1,"n_rows":487,"n_cols":15,"rows_kept":487,"cut":false,"hidden":true,"merged":[]}
["0,0715 tubki na 1 m bieżący",null,null,null,null,null,null,7.1499999999999994E-2,null,null,null,"Fix Pro",null,"Fix Extra","MAX"]
["z 1 tubki kleju nałożymy 14mb paska kleju",null,null,null,null,null,null,null,null,null,null,{"$f":"ROUNDUP(L3,0)","v":0},null,{"$f":"ROUNDUP(N3,0)","v":0},{"$f":"ROUNDUP(O3,0)","v":0}]
[null,null,null,null,null,null,"Koeff. Punktowe naniesienie kleju",0.6,null,{"$f":"SUM(J6:J487)","v":0},{"$f":"SUM(K6:K487)","v":0},{"$f":"SUM(L6:L487)*H3","v":0},null,{"$f":"SUM(N6:N487)","v":0},{"$f":"SUM(O6:O487)*H3","v":0}]
[null,null,null,null,null,null,null,null,null," "]
["Towar","rodzaj kleju do montażu  ściany/sufitu","rodzaj kleju na łączenia","Materiał","Długość, m","Ilość linii nanoszenia kleju, szt","Odcinek boczny profila (cm)","Zamówiona ilość, szt","Długość montażu, m","Kleju dla montażu PRO","Kleju dla łączeń PRO","Łącznie kleju PRO","Długość łączeń EXTRA, m","Kleju dla łąćzeń EXTRA","Kleju dla montażu MAX"]
["MD001","PRO","EXTRA","Polyforce",2,2,3,{"$f":"VLOOKUP(A6, 'GLUE CALCULATOR'!$B$4:$C$1062, 2,FALSE)","v":0},{"$f":"H6*E6*F6","v":0},{"$f":"ROUND(I6*$H$1, 4)","v":0},null,{"$f":"J6","v":0},{"$f":"H6*(G6/100)","v":0},{"$f":"(M6+M6*50%)*$H$1","v":0}]
["MD002","PRO","EXTRA","Polyforce",2,2,4,{"$f":"VLOOKUP(A7, 'GLUE CALCULATOR'!$B$4:$C$1062, 2,FALSE)","v":0},{"$f":"H7*E7*F7","v":0},{"$f":"ROUND(I7*$H$1, 4)","v":0},null,0,0,0]
["MD003","PRO","EXTRA","Polyforce",2,1,2,{"$f":"VLOOKUP(A8, 'GLUE CALCULATOR'!$B$4:$C$1062, 2,FALSE)","v":0},0,0,null,0,0,0]
["MD004","PRO","EXTRA","Polyforce",2,2,7,{"$f":"VLOOKUP(A9, 'GLUE CALCULATOR'!$B$4:$C$1062, 2,FALSE)","v":0},0,0,null,0,0,0]
["MD005","PRO","EXTRA","Polyforce",2,3,16,{"$f":"VLOOKUP(A10, 'GLUE CALCULATOR'!$B$4:$C$1062, 2,FALSE)","v":0},0,0,null,0,0,0]
["MD006","PRO","EXTRA","Polyforce",2,3,16,{"$f":"VLOOKUP(A11, 'GLUE CALCULATOR'!$B$4:$C$1062, 2,FALSE)","v":0},0,0,null,0,0,0]
["MD007","PRO","EXTRA","Polyforce",2,2,7,{"$f":"VLOOKUP(A12, 'GLUE CALCULATOR'!$B$4:$C$1062, 2,FALSE)","v":0},0,0,null,0,0,0]
["MD008","PRO","EXTRA","Polyforce",2,2,9,{"$f":"VLOOKUP(A13, 'GLUE CALCULATOR'!$B$4:$C$1062, 2,FALSE)","v":0},0,0,null,0,0,0]
["MD009","PRO","EXTRA","Polyforce",2,2,10,{"$f":"VLOOKUP(A14, 'GLUE CALCULATOR'!$B$4:$C$1062, 2,FALSE)","v":0},0,0,null,0,0,0]
["MD010","PRO","EXTRA","Polyforce",2,1,1.5,{"$f":"VLOOKUP(A15, 'GLUE CALCULATOR'!$B$4:$C$1062, 2,FALSE)","v":0},0,0,null,0,0,0]
["MD011","PRO","EXTRA","Polyforce",2,2,4,{"$f":"VLOOKUP(A16, 'GLUE CALCULATOR'!$B$4:$C$1062, 2,FALSE)","v":0},0,0,null,0,0,0]
["MD012","PRO","EXTRA","Polyforce",2,1,2,{"$f":"VLOOKUP(A17, 'GLUE CALCULATOR'!$B$4:$C$1062, 2,FALSE)","v":0},0,0,null,0,0,0]
["MD013","PRO","EXTRA","Polyforce",2,2,10,{"$f":"VLOOKUP(A18, 'GLUE CALCULATOR'!$B$4:$C$1062, 2,FALSE)","v":0},{"$f":"H18*E18*F18","v":0},0,null,{"$f":"J18","v":0},0,0]
["MD014","PRO","EXTRA","Polyforce",2,3,8,{"$f":"VLOOKUP(A19, 'GLUE CALCULATOR'!$B$4:$C$1062, 2,FALSE)","v":0},0,0,null,0,0,0]
["MD016","PRO","EXTRA","Polyforce",2,2,10,{"$f":"VLOOKUP(A20, 'GLUE CALCULATOR'!$B$4:$C$1062, 2,FALSE)","v":0},0,0,null,0,0,0]
["MD017","PRO","EXTRA","Polyforce",2,2,7,{"$f":"VLOOKUP(A21, 'GLUE CALCULATOR'!$B$4:$C$1062, 2,FALSE)","v":0},0,0,null,0,0,0]
["MD018","PRO","EXTRA","Polyforce",2,2,12,{"$f":"VLOOKUP(A22, 'GLUE CALCULATOR'!$B$4:$C$1062, 2,FALSE)","v":0},0,0,null,0,0,0]
["MD020","PRO","EXTRA","Polyforce",2,4,40,{"$f":"VLOOKUP(A23, 'GLUE CALCULATOR'!$B$4:$C$1062, 2,FALSE)","v":0},0,0,null,0,0,0]
["MD024","PRO","EXTRA","Polyforce",2,2,16,{"$f":"VLOOKUP(A24, 'GLUE CALCULATOR'!$B$4:$C$1062, 2,FALSE)","v":0},0,0,null,0,0,0]
["MD025","PRO","EXTRA","Polyforce",2,3,22,{"$f":"VLOOKUP(A25, 'GLUE CALCULATOR'!$B$4:$C$1062, 2,FALSE)","v":0},0,0,null,0,0,0]
["MD026","PRO","EXTRA","Polyforce",2,2,4,{"$f":"VLOOKUP(A26, 'GLUE CALCULATOR'!$B$4:$C$1062, 2,FALSE)","v":0},0,0,null,0,0,0]
["MD027","PRO","EXTRA","Polyforce",2,2,6,{"$f":"VLOOKUP(A27, 'GLUE CALCULATOR'!$B$4:$C$1062, 2,FALSE)","v":0},0,0,null,0,0,0]
["MD028","PRO","EXTRA","Polyforce",2,2,6,{"$f":"VLOOKUP(A28, 'GLUE CALCULATOR'!$B$4:$C$1062, 2,FALSE)","v":0},0,0,null,0,0,0]
["MD030","PRO","EXTRA","Polyforce",2,2,8,{"$f":"VLOOKUP(A29, 'GLUE CALCULATOR'!$B$4:$C$1062, 2,FALSE)","v":0},0,0,null,0,0,0]
["MD031","PRO","EXTRA","Polyforce",2,2,3,{"$f":"VLOOKUP(A30, 'GLUE CALCULATOR'!$B$4:$C$1062, 2,FALSE)","v":0},0,0,null,0,0,0]
["MD032","PRO","EXTRA","Polyforce",2,2,6,{"$f":"VLOOKUP(A31, 'GLUE CALCULATOR'!$B$4:$C$1062, 2,FALSE)","v":0},0,0,null,0,0,0]
["MD057","PRO","EXTRA","Polyforce",2,2,11,{"$f":"VLOOKUP(A32, 'GLUE CALCULATOR'!$B$4:$C$1062, 2,FALSE)","v":0},{"$f":"H32*E32*F32","v":0},{"$f":"ROUND(I32*$H$1, 4)","v":0},null,{"$f":"J32","v":0},{"$f":"H32*(G32/100)","v":0},{"$f":"(M32+M32*50%)*$H$1","v":0}]
["MD070","PRO","EXTRA","Polyforce",2,2,11,{"$f":"VLOOKUP(A33, 'GLUE CALCULATOR'!$B$4:$C$1062, 2,FALSE)","v":0},0,0,null,0,0,0]
["MD094","PRO","EXTRA","Polyforce",2,2,9.5,{"$f":"VLOOKUP(A34, 'GLUE CALCULATOR'!$B$4:$C$1062, 2,FALSE)","v":0},0,0,null,0,0,0]
["MD095","PRO","EXTRA","Polyforce",2,3,18,{"$f":"VLOOKUP(A35, 'GLUE CALCULATOR'!$B$4:$C$1062, 2,FALSE)","v":0},0,0,null,0,0,0]
["MD105","MAX","EXTRA","Polyforce",2,4,35,{"$f":"VLOOKUP(A36, 'GLUE CALCULATOR'!$B$4:$C$1062, 2,FALSE)","v":0},0,null,null,null,0,0,{"$f":"ROUND(I36*$H$1, 4)","v":0}]
["MD105H","MAX","EXTRA","Polyforce",3,4,35,{"$f":"VLOOKUP(A37, 'GLUE CALCULATOR'!$B$4:$C$1062, 2,FALSE)","v":0},{"$f":"H37*E37*F37","v":0},null,null,null,{"$f":"H37*(G37/100)","v":0},{"$f":"(M37+M37*50%)*$H$1","v":0},{"$f":"ROUND(I37*$H$1, 4)","v":0}]
["MD106","PRO","EXTRA","Polyforce",2,2,10,{"$f":"VLOOKUP(A38, 'GLUE CALCULATOR'!$B$4:$C$1062, 2,FALSE)","v":0},0,0,null,0,0,0]
["MD110","MAX","EXTRA","Polyforce",2,2,13,{"$f":"VLOOKUP(A39, 'GLUE CALCULATOR'!$B$4:$C$1062, 2,FALSE)","v":0},0,null,null,null,0,0,{"$f":"ROUND(I39*$H$1, 4)","v":0}]
["MD111","MAX","EXTRA","Polyforce",2,2,11,{"$f":"VLOOKUP(A40, 'GLUE CALCULATOR'!$B$4:$C$1062, 2,FALSE)","v":0},0,null,null,null,0,0,{"$f":"ROUND(I40*$H$1, 4)","v":0}]
["MD118","PRO","EXTRA","Polyforce",2,1,9,{"$f":"VLOOKUP(A41, 'GLUE CALCULATOR'!$B$4:$C$1062, 2,FALSE)","v":0},0,0,null,0,0,0]
["MD137","MAX","EXTRA","Polyforce",2,3,11,{"$f":"VLOOKUP(A42, 'GLUE CALCULATOR'!$B$4:$C$1062, 2,FALSE)","v":0},0,null,null,null,0,0,{"$f":"ROUND(I42*$H$1, 4)","v":0}]
["MD145","PRO","EXTRA","Polyforce",2,2,14,{"$f":"VLOOKUP(A43, 'GLUE CALCULATOR'!$B$4:$C$1062, 2,FALSE)","v":0},0,0,null,0,0,0]
["MD156","MAX","EXTRA","Polyforce",2,4,40,{"$f":"VLOOKUP(A44, 'GLUE CALCULATOR'!$B$4:$C$1062, 2,FALSE)","v":0},0,null,null,null,0,0,{"$f":"ROUND(I44*$H$1, 4)","v":0}]
["MD161","MAX","EXTRA","Polyforce",2,3,28,{"$f":"VLOOKUP(A45, 'GLUE CALCULATOR'!$B$4:$C$1062, 2,FALSE)","v":0},0,null,null,null,0,0,{"$f":"ROUND(I45*$H$1, 4)","v":0}]
["MD172","PRO","EXTRA","Polyforce",2,2,8,{"$f":"VLOOKUP(A46, 'GLUE CALCULATOR'!$B$4:$C$1062, 2,FALSE)","v":0},0,0,null,0,0,0]
["MD210","PRO","EXTRA","Polyforce",2,2,8,{"$f":"VLOOKUP(A47, 'GLUE CALCULATOR'!$B$4:$C$1062, 2,FALSE)","v":0},0,0,null,0,0,0]
["MD213","MAX","EXTRA","Polyforce",2,2,18,{"$f":"VLOOKUP(A48, 'GLUE CALCULATOR'!$B$4:$C$1062, 2,FALSE)","v":0},0,null,null,null,0,0,{"$f":"ROUND(I48*$H$1, 4)","v":0}]
["MD234","PRO","EXTRA","Polyforce",2,2,10,{"$f":"VLOOKUP(A49, 'GLUE CALCULATOR'!$B$4:$C$1062, 2,FALSE)","v":0},0,0,null,0,0,0]
["MD235","PRO","EXTRA","Polyforce",2,2,2,{"$f":"VLOOKUP(A50, 'GLUE CALCULATOR'!$B$4:$C$1062, 2,FALSE)","v":0},0,0,null,0,0,0]
["MD236","PRO","EXTRA","Polyforce",2,2,15,{"$f":"VLOOKUP(A51, 'GLUE CALCULATOR'!$B$4:$C$1062, 2,FALSE)","v":0},0,0,null,0,0,0]
["MD237","PRO","EXTRA","Polyforce",2,2,6,{"$f":"VLOOKUP(A52, 'GLUE CALCULATOR'!$B$4:$C$1062, 2,FALSE)","v":0},0,0,null,0,0,0]
["MD255","PRO","EXTRA","Polyforce",2,2,4,{"$f":"VLOOKUP(A53, 'GLUE CALCULATOR'!$B$4:$C$1062, 2,FALSE)","v":0},0,0,null,0,0,0]
["MD258","PRO","EXTRA","Polyforce",2,2,12,{"$f":"VLOOKUP(A54, 'GLUE CALCULATOR'!$B$4:$C$1062, 2,FALSE)","v":0},0,0,null,0,0,0]
["MD308","PRO","EXTRA","Polyforce",2,2,10,{"$f":"VLOOKUP(A55, 'GLUE CALCULATOR'!$B$4:$C$1062, 2,FALSE)","v":0},0,0,null,0,0,0]
["MD314","PRO","EXTRA","Polyforce",2,2,8,{"$f":"VLOOKUP(A56, 'GLUE CALCULATOR'!$B$4:$C$1062, 2,FALSE)","v":0},0,0,null,0,0,0]
["MD317","PRO","EXTRA","Polyforce",2,2,5,{"$f":"VLOOKUP(A57, 'GLUE CALCULATOR'!$B$4:$C$1062, 2,FALSE)","v":0},0,0,null,0,0,0]
["MD318","PRO","EXTRA","Polyforce",2,2,5,{"$f":"VLOOKUP(A58, 'GLUE CALCULATOR'!$B$4:$C$1062, 2,FALSE)","v":0},0,0,null,0,0,0]
["MD325","PRO","EXTRA","Polyforce",2,2,6,{"$f":"VLOOKUP(A59, 'GLUE CALCULATOR'!$B$4:$C$1062, 2,FALSE)","v":0},0,0,null,0,0,0]
["MD332","PRO","EXTRA","Polyforce",2,2,4,{"$f":"VLOOKUP(A60, 'GLUE CALCULATOR'!$B$4:$C$1062, 2,FALSE)","v":0},{"$f":"H60*E60*F60","v":0},{"$f":"ROUND(I60*$H$1, 4)","v":0},null,0,0,0]
["MD338","PRO","EXTRA","Polyforce",2,2,10,{"$f":"VLOOKUP(A61, 'GLUE CALCULATOR'!$B$4:$C$1062, 2,FALSE)","v":0},0,0,null,0,0,0]
["MD346","PRO","EXTRA","Polyforce",2,2,9,{"$f":"VLOOKUP(A62, 'GLUE CALCULATOR'!$B$4:$C$1062, 2,FALSE)","v":0},0,0,null,0,0,0]
["MD354","PRO","EXTRA","Polyforce",2,2,14,{"$f":"VLOOKUP(A63, 'GLUE CALCULATOR'!$B$4:$C$1062, 2,FALSE)","v":0},0,0,null,0,0,0]
["MD355","PRO","EXTRA","Polyforce",2,3,18,{"$f":"VLOOKUP(A64, 'GLUE CALCULATOR'!$B$4:$C$1062, 2,FALSE)","v":0},0,0,null,0,0,0]
["MD356","PRO","EXTRA","Polyforce",2,3,20,{"$f":"VLOOKUP(A65, 'GLUE CALCULATOR'!$B$4:$C$1062, 2,FALSE)","v":0},0,0,null,0,0,0]
["MD358","PRO","EXTRA","Polyforce",2,3,20,{"$f":"VLOOKUP(A66, 'GLUE CALCULATOR'!$B$4:$C$1062, 2,FALSE)","v":0},0,0,null,0,0,0]
["MD359","PRO","EXTRA","Polyforce",2,2,13,{"$f":"VLOOKUP(A67, 'GLUE CALCULATOR'!$B$4:$C$1062, 2,FALSE)","v":0},0,0,null,0,0,0]
["MD359B","PRO","EXTRA","Polyforce",2,2,13,{"$f":"VLOOKUP(A68, 'GLUE CALCULATOR'!$B$4:$C$1062, 2,FALSE)","v":0},0,0,null,0,0,0]
["MD360","PRO","EXTRA","Polyforce",2,3,25,{"$f":"VLOOKUP(A69, 'GLUE CALCULATOR'!$B$4:$C$1062, 2,FALSE)","v":0},0,0,null,0,0,0]
["MD361","PRO","EXTRA","Polyforce",2,3,22,{"$f":"VLOOKUP(A70, 'GLUE CALCULATOR'!$B$4:$C$1062, 2,FALSE)","v":0},0,0,null,0,0,0]
["MD362","MAX","EXTRA","Polyforce",2,3,38,{"$f":"VLOOKUP(A71, 'GLUE CALCULATOR'!$B$4:$C$1062, 2,FALSE)","v":0},0,null,null,null,0,0,{"$f":"ROUND(I71*$H$1, 4)","v":0}]
["MD363","PRO","EXTRA","Polyforce",2,2,14,{"$f":"VLOOKUP(A72, 'GLUE CALCULATOR'!$B$4:$C$1062, 2,FALSE)","v":0},0,0,null,{"$f":"J72","v":0},{"$f":"H72*(G72/100)","v":0},{"$f":"(M72+M72*50%)*$H$1","v":0}]
["MD367","MAX","EXTRA","Polyforce",2,2,13,{"$f":"VLOOKUP(A73, 'GLUE CALCULATOR'!$B$4:$C$1062, 2,FALSE)","v":0},0,null,null,null,0,0,{"$f":"ROUND(I73*$H$1, 4)","v":0}]
["MD368","PRO","EXTRA","Polyforce",2,2,8,{"$f":"VLOOKUP(A74, 'GLUE CALCULATOR'!$B$4:$C$1062, 2,FALSE)","v":0},0,0,null,0,0,0]
["MD380","MAX","EXTRA","Polyforce",2,2,17,{"$f":"VLOOKUP(A75, 'GLUE CALCULATOR'!$B$4:$C$1062, 2,FALSE)","v":0},{"$f":"H75*E75*F75","v":0},null,null,null,0,0,{"$f":"ROUND(I75*$H$1, 4)","v":0}]
["MD413","PRO","EXTRA","Polyforce",2,1,3,{"$f":"VLOOKUP(A76, 'GLUE CALCULATOR'!$B$4:$C$1062, 2,FALSE)","v":0},0,{"$f":"ROUND(I76*$H$1, 4)","v":0},null,0,0,0]
["MD8300","PRO","EXTRA","Polyforce",2,2,12,{"$f":"VLOOKUP(A77, 'GLUE CALCULATOR'!$B$4:$C$1062, 2,FALSE)","v":0},0,0,null,0,0,0]
["MDA002","PRO","EXTRA","Profoam",2,2,15,{"$f":"VLOOKUP(A78, 'GLUE CALCULATOR'!$B$4:$C$1062, 2,FALSE)","v":0},0,0,null,0,0,0]
["MDA005","PRO","EXTRA","Profoam",2,2,11,{"$f":"VLOOKUP(A79, 'GLUE CALCULATOR'!$B$4:$C$1062, 2,FALSE)","v":0},0,0,null,0,0,0]
["MDA007","PRO","EXTRA","Profoam",2,2,20,{"$f":"VLOOKUP(A80, 'GLUE CALCULATOR'!$B$4:$C$1062, 2,FALSE)","v":0},0,0,null,0,0,0]
{"$rows_left_out":408}
{"sheet":"User Instructions","index":2,"n_rows":11,"n_cols":1,"rows_kept":11,"cut":false,"hidden":false,"merged":[]}
["Kalkulačka lepidel – návod k použití"]
[]
["Kalkulačka slouží k přesnému výpočtu množství lepidla potřebného pro instalaci lineárních produktů, jako jsou nástěnné panely, soklové lišty, stěnové lišty, garnýžové profily, stropní lišty, osvětlovací profily apod."]
[]
["Vyplňovat lze pouze zelená pole, ostatní buňky jsou uzamčené. Do příslušných zelených polí zadejte požadovaný počet instalovaných profilů."]
[]
["V horní části kalkulačky se zobrazí výsledky, tedy potřebný počet kartuší lepidel Fix Pro, Fix Extra a MAX."]
[]
["V posledním sloupci s názvem „Typy montážních lepidel“ najdete doporučení, kdy použít lepidla Mardom Fix Pro nebo MAX."]
[]
["Pro vymazání zadaných hodnot v zelených polích stačí kliknout na tlačítko „Smazat obsah buněk“."]