{"text_format":"1","workbook":"xlsx","n_sheets":3,"sheets":["GLUE CALCULATOR","obliczenia kleju","User Instructions"],"not_rendered":{"charts":0,"images":3,"macros":1,"external_links":0,"defined_names":2,"comments":0,"pivot_tables":0},"unopened":[],"bounds":{"document_bytes":16777216,"sheet_cells":100000,"rows_first":2000,"rows_last":500,"rows_between":2000,"halvings":0,"cell_chars":16384,"cell_head_chars":4096},"cells_cut":0,"cells_raw":0,"read":"whole","date_system":"1900"}

{"sheet":"GLUE CALCULATOR","index":0,"n_rows":486,"n_cols":12,"rows_kept":486,"cut":false,"hidden":false,"merged":[]}
[null,"FIX PRO","pcs.",null,"FIX EXTRA","pcs.",null,"MAX",null,"pcs."]
[null,null,{"$f":"'obliczenia kleju'!L2","v":0},null,null,{"$f":"'obliczenia kleju'!N2","v":0},null,null,null,{"$f":"'obliczenia kleju'!O2","v":0},null,"Poznámka: Lepidlo FIX EXTRA se doporučuje pro všechny spoje mezi produkty Profoam, FLEX a Polyforce. MAX: Záclonové a těžké profily."]
[]
["Nr","Kód produktu","Počet lišt (ks)",null,"Sortiment","Materiál","Výška, \ncm","Šířka, \ncm","Délka, \ncm","Typ montážního lepidla"]
[1,"MD001",null,null,"Podlahové lišty","Polyforce",2.1,2.1,200,{"$f":"VLOOKUP('GLUE CALCULATOR'!B5, 'obliczenia kleju'!$A$5:$B$1060, 2,FALSE)","v":"PRO"}]
[2,"MD004",null,null,"Podlahové lišty","Polyforce",4.9000000000000004,1.5,200,{"$f":"VLOOKUP('GLUE CALCULATOR'!B6, 'obliczenia kleju'!$A$5:$B$1060, 2,FALSE)","v":"PRO"}]
[3,"MD005",null,null,"Podlahové lišty","Polyforce",11,2.2000000000000002,200,{"$f":"VLOOKUP('GLUE CALCULATOR'!B7, 'obliczenia kleju'!$A$5:$B$1060, 2,FALSE)","v":"PRO"}]
[4,"MD006",null,null,"Podlahové lišty","Polyforce",10.1,2.2999999999999998,200,{"$f":"VLOOKUP('GLUE CALCULATOR'!B8, 'obliczenia kleju'!$A$5:$B$1060, 2,FALSE)","v":"PRO"}]
[5,"MD008",null,null,"Podlahové lišty","Polyforce",8,1.7,200,{"$f":"VLOOKUP('GLUE CALCULATOR'!B9, 'obliczenia kleju'!$A$5:$B$1060, 2,FALSE)","v":"PRO"}]
[6,"MD009",null,null,"Podlahové lišty","Polyforce",10,1.7,200,{"$f":"VLOOKUP('GLUE CALCULATOR'!B10, 'obliczenia kleju'!$A$5:$B$1060, 2,FALSE)","v":"PRO"}]
[7,"MD011",null,null,"Podlahové lišty","Polyforce",4,1,200,{"$f":"VLOOKUP('GLUE CALCULATOR'!B11, 'obliczenia kleju'!$A$5:$B$1060, 2,FALSE)","v":"PRO"}]
[8,"MD013",null,null,"Podlahové lišty","Polyforce",10,1,200,{"$f":"VLOOKUP('GLUE CALCULATOR'!B12, 'obliczenia kleju'!$A$5:$B$1060, 2,FALSE)","v":"PRO"}]
[9,"MD014",null,null,"Podlahové lišty","Polyforce",8,1.4,200,{"$f":"VLOOKUP('GLUE CALCULATOR'!B13, 'obliczenia kleju'!$A$5:$B$1060, 2,FALSE)","v":"PRO"}]
[10,"MD016",null,null,"Podlahové lišty","Polyforce",10,2.2999999999999998,200,{"$f":"VLOOKUP('GLUE CALCULATOR'!B14, 'obliczenia kleju'!$A$5:$B$1060, 2,FALSE)","v":"PRO"}]
[11,"MD017",null,null,"Podlahové lišty","Polyforce",6.9,1.4,200,{"$f":"VLOOKUP('GLUE CALCULATOR'!B15, 'obliczenia kleju'!$A$5:$B$1060, 2,FALSE)","v":"PRO"}]
[12,"MD018",null,null,"Podlahové lišty","Polyforce",8,1.3,200,{"$f":"VLOOKUP('GLUE CALCULATOR'!B16, 'obliczenia kleju'!$A$5:$B$1060, 2,FALSE)","v":"PRO"}]
[13,"MD020",null,null,"Podlahové lišty","Polyforce",19.8,1.9,200,{"$f":"VLOOKUP('GLUE CALCULATOR'!B17, 'obliczenia kleju'!$A$5:$B$1060, 2,FALSE)","v":"PRO"}]
[14,"MD024",null,null,"Podlahové lišty","Polyforce",8,2.7,200,{"$f":"VLOOKUP('GLUE CALCULATOR'!B18, 'obliczenia kleju'!$A$5:$B$1060, 2,FALSE)","v":"PRO"}]
[15,"MD025",null,null,"Podlahové lišty","Polyforce",11,2.7,200,{"$f":"VLOOKUP('GLUE CALCULATOR'!B19, 'obliczenia kleju'!$A$5:$B$1060, 2,FALSE)","v":"PRO"}]
[16,"MD027",null,null,"Podlahové lišty","Polyforce",6,1.3,200,{"$f":"VLOOKUP('GLUE CALCULATOR'!B20, 'obliczenia kleju'!$A$5:$B$1060, 2,FALSE)","v":"PRO"}]
[17,"MD028",null,null,"Podlahové lišty","Polyforce",6,1.3,200,{"$f":"VLOOKUP('GLUE CALCULATOR'!B21, 'obliczenia kleju'!$A$5:$B$1060, 2,FALSE)","v":"PRO"}]
[18,"MD030",null,null,"Podlahové lišty","Polyforce",8,1.7,200,{"$f":"VLOOKUP('GLUE CALCULATOR'!B22, 'obliczenia kleju'!$A$5:$B$1060, 2,FALSE)","v":"PRO"}]
[19,"MD032",null,null,"Podlahové lišty","Polyforce",6,1.3,200,{"$f":"VLOOKUP('GLUE CALCULATOR'!B23, 'obliczenia kleju'!$A$5:$B$1060, 2,FALSE)","v":"PRO"}]
[20,"MD057",null,null,"Podlahové lišty","Polyforce",5.7,1.5,200,{"$f":"VLOOKUP('GLUE CALCULATOR'!B24, 'obliczenia kleju'!$A$5:$B$1060, 2,FALSE)","v":"PRO"}]
[21,"MD094",null,null,"Podlahové lišty","Polyforce",9.4,1.2,200,{"$f":"VLOOKUP('GLUE CALCULATOR'!B25, 'obliczenia kleju'!$A$5:$B$1060, 2,FALSE)","v":"PRO"}]
[22,"MD095",null,null,"Podlahové lišty","Polyforce",12,1.5,200,{"$f":"VLOOKUP('GLUE CALCULATOR'!B26, 'obliczenia kleju'!$A$5:$B$1060, 2,FALSE)","v":"PRO"}]
[23,"MD234",null,null,"Podlahové lišty","Polyforce",7.8,1.4,200,{"$f":"VLOOKUP('GLUE CALCULATOR'!B27, 'obliczenia kleju'!$A$5:$B$1060, 2,FALSE)","v":"PRO"}]
[24,"MD235",null,null,"Podlahové lišty","Polyforce",1.8,1.8,200,{"$f":"VLOOKUP('GLUE CALCULATOR'!B28, 'obliczenia kleju'!$A$5:$B$1060, 2,FALSE)","v":"PRO"}]
[25,"MD236",null,null,"Podlahové lišty","Polyforce",9.9,1.3,200,{"$f":"VLOOKUP('GLUE CALCULATOR'!B29, 'obliczenia kleju'!$A$5:$B$1060, 2,FALSE)","v":"PRO"}]
[26,"MD258",null,null,"Podlahové lišty","Polyforce",8.1,1,200,{"$f":"VLOOKUP('GLUE CALCULATOR'!B30, 'obliczenia kleju'!$A$5:$B$1060, 2,FALSE)","v":"PRO"}]
[27,"MD354",null,null,"Podlahové lišty","Polyforce",10.7,1.1000000000000001,200,{"$f":"VLOOKUP('GLUE CALCULATOR'!B31, 'obliczenia kleju'!$A$5:$B$1060, 2,FALSE)","v":"PRO"}]
[28,"MD355",null,null,"Podlahové lišty","Polyforce",9.6999999999999993,1.8,200,{"$f":"VLOOKUP('GLUE CALCULATOR'!B32, 'obliczenia kleju'!$A$5:$B$1060, 2,FALSE)","v":"PRO"}]
[29,"MD356",null,null,"Podlahové lišty","Polyforce",10.8,1.6,200,{"$f":"VLOOKUP('GLUE CALCULATOR'!B33, 'obliczenia kleju'!$A$5:$B$1060, 2,FALSE)","v":"PRO"}]
[30,"MD358",null,null,"Podlahové lišty","Polyforce",11.7,1.4,200,{"$f":"VLOOKUP('GLUE CALCULATOR'!B34, 'obliczenia kleju'!$A$5:$B$1060, 2,FALSE)","v":"PRO"}]
[31,"MD359",null,null,"Podlahové lišty","Polyforce",7,1.6,200,{"$f":"VLOOKUP('GLUE CALCULATOR'!B35, 'obliczenia kleju'!$A$5:$B$1060, 2,FALSE)","v":"PRO"}]
[32,"MD359B",null,null,"Podlahové lišty","Polyforce",7,1.6,200,{"$f":"VLOOKUP('GLUE CALCULATOR'!B36, 'obliczenia kleju'!$A$5:$B$1060, 2,FALSE)","v":"PRO"}]
[33,"MD360",null,null,"Podlahové lišty","Polyforce",13.7,1.8,200,{"$f":"VLOOKUP('GLUE CALCULATOR'!B37, 'obliczenia kleju'!$A$5:$B$1060, 2,FALSE)","v":"PRO"}]
[34,"MD361",null,null,"Podlahové lišty","Polyforce",14.4,1.5,200,{"$f":"VLOOKUP('GLUE CALCULATOR'!B38, 'obliczenia kleju'!$A$5:$B$1060, 2,FALSE)","v":"PRO"}]
[35,"MD363",null,null,"Podlahové lišty","Polyforce",10.6,2.2999999999999998,200,{"$f":"VLOOKUP('GLUE CALCULATOR'!B39, 'obliczenia kleju'!$A$5:$B$1060, 2,FALSE)","v":"PRO"}]
[36,"MD8300",null,null,"Podlahové lišty","Polyforce",8.1999999999999993,2.6,200,{"$f":"VLOOKUP('GLUE CALCULATOR'!B40, 'obliczenia kleju'!$A$5:$B$1060, 2,FALSE)","v":"PRO"}]
[37,"QS003",null,null,"Podlahové lišty","Polyforce",12.8,1.8,200,{"$f":"VLOOKUP('GLUE CALCULATOR'!B41, 'obliczenia kleju'!$A$5:$B$1060, 2,FALSE)","v":"PRO"}]
[38,"QS004",null,null,"Podlahové lišty","Polyforce",10.8,1.5,200,{"$f":"VLOOKUP('GLUE CALCULATOR'!B42, 'obliczenia kleju'!$A$5:$B$1060, 2,FALSE)","v":"PRO"}]
[39,"QS009",null,null,"Podlahové lišty","Polyforce",10,1.6,200,{"$f":"VLOOKUP('GLUE CALCULATOR'!B43, 'obliczenia kleju'!$A$5:$B$1060, 2,FALSE)","v":"PRO"}]
[40,"QS011",null,null,"Podlahové lišty","Polyforce",13.5,4,200,{"$f":"VLOOKUP('GLUE CALCULATOR'!B44, 'obliczenia kleju'!$A$5:$B$1060, 2,FALSE)","v":"PRO"}]
[41,"MD001P",null,null,"Prémiové lišty","Polyforce",2.1,2.1,200,{"$f":"VLOOKUP('GLUE CALCULATOR'!B45, 'obliczenia kleju'!$A$5:$B$1060, 2,FALSE)","v":"PRO"}]
[42,"MD004P",null,null,"Prémiové lišty","Polyforce",4.9000000000000004,1.5,200,{"$f":"VLOOKUP('GLUE CALCULATOR'!B46, 'obliczenia kleju'!$A$5:$B$1060, 2,FALSE)","v":"PRO"}]
[43,"MD005P",null,null,"Prémiové lišty","Polyforce",11,2.2000000000000002,200,{"$f":"VLOOKUP('GLUE CALCULATOR'!B47, 'obliczenia kleju'!$A$5:$B$1060, 2,FALSE)","v":"PRO"}]
[44,"MD006P",null,null,"Prémiové lišty","Polyforce",10.1,2.2999999999999998,200,{"$f":"VLOOKUP('GLUE CALCULATOR'!B48, 'obliczenia kleju'!$A$5:$B$1060, 2,FALSE)","v":"PRO"}]
[45,"MD008P",null,null,"Prémiové lišty","Polyforce",8,1.7,200,{"$f":"VLOOKUP('GLUE CALCULATOR'!B49, 'obliczenia kleju'!$A$5:$B$1060, 2,FALSE)","v":"PRO"}]
[46,"MD009P",null,null,"Prémiové lišty","Polyforce",10,1.7,200,{"$f":"VLOOKUP('GLUE CALCULATOR'!B50, 'obliczenia kleju'!$A$5:$B$1060, 2,FALSE)","v":"PRO"}]
[47,"MD011P",null,null,"Prémiové lišty","Polyforce",4,1,200,{"$f":"VLOOKUP('GLUE CALCULATOR'!B51, 'obliczenia kleju'!$A$5:$B$1060, 2,FALSE)","v":"PRO"}]
[48,"MD013P",null,null,"Prémiové lišty","Polyforce",10,1,200,{"$f":"VLOOKUP('GLUE CALCULATOR'!B52, 'obliczenia kleju'!$A$5:$B$1060, 2,FALSE)","v":"PRO"}]
[49,"MD014P",null,null,"Prémiové lišty","Polyforce",8,1.4,200,{"$f":"VLOOKUP('GLUE CALCULATOR'!B53, 'obliczenia kleju'!$A$5:$B$1060, 2,FALSE)","v":"PRO"}]
[50,"MD016P",null,null,"Prémiové lišty","Polyforce",10,2.2999999999999998,200,{"$f":"VLOOKUP('GLUE CALCULATOR'!B54, 'obliczenia kleju'!$A$5:$B$1060, 2,FALSE)","v":"PRO"}]
[51,"MD017P",null,null,"Prémiové lišty","Polyforce",6.9,1.4,200,{"$f":"VLOOKUP('GLUE CALCULATOR'!B55, 'obliczenia kleju'!$A$5:$B$1060, 2,FALSE)","v":"PRO"}]
[52,"MD018P",null,null,"Prémiové lišty","Polyforce",8,1.3,200,{"$f":"VLOOKUP('GLUE CALCULATOR'!B56, 'obliczenia kleju'!$A$5:$B$1060, 2,FALSE)","v":"PRO"}]
[53,"MD020P",null,null,"Prémiové lišty","Polyforce",19.8,1.9,200,{"$f":"VLOOKUP('GLUE CALCULATOR'!B57, 'obliczenia kleju'!$A$5:$B$1060, 2,FALSE)","v":"PRO"}]
[54,"MD024P",null,null,"Prémiové lišty","Polyforce",8,2.7,200,{"$f":"VLOOKUP('GLUE CALCULATOR'!B58, 'obliczenia kleju'!$A$5:$B$1060, 2,FALSE)","v":"PRO"}]
[55,"MD025P",null,null,"Prémiové lišty","Polyforce",11,2.7,200,{"$f":"VLOOKUP('GLUE CALCULATOR'!B59, 'obliczenia kleju'!$A$5:$B$1060, 2,FALSE)","v":"PRO"}]
[56,"MD027P",null,null,"Prémiové lišty","Polyforce",6,1.3,200,{"$f":"VLOOKUP('GLUE CALCULATOR'!B60, 'obliczenia kleju'!$A$5:$B$1060, 2,FALSE)","v":"PRO"}]
[57,"MD028P",null,null,"Prémiové lišty","Polyforce",6,1.3,200,{"$f":"VLOOKUP('GLUE CALCULATOR'!B61, 'obliczenia kleju'!$A$5:$B$1060, 2,FALSE)","v":"PRO"}]
[58,"MD030P",null,null,"Prémiové lišty","Polyforce",8,1.7,200,{"$f":"VLOOKUP('GLUE CALCULATOR'!B62, 'obliczenia kleju'!$A$5:$B$1060, 2,FALSE)","v":"PRO"}]
[59,"MD032P",null,null,"Prémiové lišty","Polyforce",6,1.3,200,{"$f":"VLOOKUP('GLUE CALCULATOR'!B63, 'obliczenia kleju'!$A$5:$B$1060, 2,FALSE)","v":"PRO"}]
[60,"MD094P",null,null,"Prémiové lišty","Polyforce",9.4,1.2,200,{"$f":"VLOOKUP('GLUE CALCULATOR'!B64, 'obliczenia kleju'!$A$5:$B$1060, 2,FALSE)","v":"PRO"}]
[61,"MD095P",null,null,"Prémiové lišty","Polyforce",12,1.5,200,{"$f":"VLOOKUP('GLUE CALCULATOR'!B65, 'obliczenia kleju'!$A$5:$B$1060, 2,FALSE)","v":"PRO"}]
[62,"MD234P",null,null,"Prémiové lišty","Polyforce",7.8,1.4,200,{"$f":"VLOOKUP('GLUE CALCULATOR'!B66, 'obliczenia kleju'!$A$5:$B$1060, 2,FALSE)","v":"PRO"}]
[63,"MD235P",null,null,"Prémiové lišty","Polyforce",1.8,1.8,200,{"$f":"VLOOKUP('GLUE CALCULATOR'!B67, 'obliczenia kleju'!$A$5:$B$1060, 2,FALSE)","v":"PRO"}]
[64,"MD236P",null,null,"Prémiové lišty","Polyforce",9.9,1.3,200,{"$f":"VLOOKUP('GLUE CALCULATOR'!B68, 'obliczenia kleju'!$A$5:$B$1060, 2,FALSE)","v":"PRO"}]
[65,"MD258P",null,null,"Prémiové lišty","Polyforce",8.1,1,200,{"$f":"VLOOKUP('GLUE CALCULATOR'!B69, 'obliczenia kleju'!$A$5:$B$1060, 2,FALSE)","v":"PRO"}]
[66,"MD354P",null,null,"Prémiové lišty","Polyforce",10.7,1.1000000000000001,200,{"$f":"VLOOKUP('GLUE CALCULATOR'!B70, 'obliczenia kleju'!$A$5:$B$1060, 2,FALSE)","v":"PRO"}]
[67,"MD355P",null,null,"Prémiové lišty","Polyforce",9.6999999999999993,1.8,200,{"$f":"VLOOKUP('GLUE CALCULATOR'!B71, 'obliczenia kleju'!$A$5:$B$1060, 2,FALSE)","v":"PRO"}]
[68,"MD356P",null,null,"Prémiové lišty","Polyforce",10.8,1.6,200,{"$f":"VLOOKUP('GLUE CALCULATOR'!B72, 'obliczenia kleju'!$A$5:$B$1060, 2,FALSE)","v":"PRO"}]
[69,"MD358P",null,null,"Prémiové lišty","Polyforce",11.7,1.4,200,{"$f":"VLOOKUP('GLUE CALCULATOR'!B73, 'obliczenia kleju'!$A$5:$B$1060, 2,FALSE)","v":"PRO"}]
[70,"MD359P",null,null,"Prémiové lišty","Polyforce",7,1.6,200,{"$f":"VLOOKUP('GLUE CALCULATOR'!B74, 'obliczenia kleju'!$A$5:$B$1060, 2,FALSE)","v":"PRO"}]
[71,"MD360P",null,null,"Prémiové lišty","Polyforce",13.7,1.8,200,{"$f":"VLOOKUP('GLUE CALCULATOR'!B75, 'obliczenia kleju'!$A$5:$B$1060, 2,FALSE)","v":"PRO"}]
[72,"MD361P",null,null,"Prémiové lišty","Polyforce",14.4,1.5,200,{"$f":"VLOOKUP('GLUE CALCULATOR'!B76, 'obliczenia kleju'!$A$5:$B$1060, 2,FALSE)","v":"PRO"}]
[73,"MD363P",null,null,"Prémiové lišty","Polyforce",10.6,2.2999999999999998,200,{"$f":"VLOOKUP('GLUE CALCULATOR'!B77, 'obliczenia kleju'!$A$5:$B$1060, 2,FALSE)","v":"PRO"}]
[74,"MD8300P",null,null,"Prémiové lišty","Polyforce",8.1999999999999993,2.6,200,{"$f":"VLOOKUP('GLUE CALCULATOR'!B78, 'obliczenia kleju'!$A$5:$B$1060, 2,FALSE)","v":"PRO"}]
[75,"QL007P",null,null,"Prémiové lišty","Polyforce",9.3000000000000007,4,200,{"$f":"VLOOKUP('GLUE CALCULATOR'!B79, 'obliczenia kleju'!$A$5:$B$1060, 2,FALSE)","v":"PRO"}]
[76,"QL019P",null,null,"Lišty PRO Led osvětlení","Polyforce",8,2.5,200,{"$f":"VLOOKUP('GLUE CALCULATOR'!B80, 'obliczenia kleju'!$A$5:$B$1060, 2,FALSE)","v":"PRO"}]
[77,"QL021P",null,null,"Prémiové lišty","Polyforce",2,2.5,200,{"$f":"VLOOKUP('GLUE CALCULATOR'!B81, 'obliczenia kleju'!$A$5:$B$1060, 2,FALSE)","v":"PRO"}]
[78,"QS003P",null,null,"Prémiové lišty","Polyforce",12.8,1.8,200,{"$f":"VLOOKUP('GLUE CALCULATOR'!B82, 'obliczenia kleju'!$A$5:$B$1060, 2,FALSE)","v":"PRO"}]
[79,"QS004P",null,null,"Prémiové lišty","Polyforce",10.8,1.5,200,{"$f":"VLOOKUP('GLUE CALCULATOR'!B83, 'obliczenia kleju'!$A$5:$B$1060, 2,FALSE)","v":"PRO"}]
[80,"QS009P",null,null,"Prémiové lišty","Polyforce",10,1.6,200,{"$f":"VLOOKUP('GLUE CALCULATOR'!B84, 'obliczenia kleju'!$A$5:$B$1060, 2,FALSE)","v":"PRO"}]
[81,"QS011P",null,null,"Prémiové lišty","Polyforce",13.5,4,200,{"$f":"VLOOKUP('GLUE CALCULATOR'!B85, 'obliczenia kleju'!$A$5:$B$1060, 2,FALSE)","v":"PRO"}]
[82,"MD018F",null,null,"Podlahové lišty - ohebné","Flexible Profoam",8,1.3,200,{"$f":"VLOOKUP('GLUE CALCULATOR'!B86, 'obliczenia kleju'!$A$5:$B$1060, 2,FALSE)","v":"PRO"}]
[83,"MD234F",null,null,"Podlahové lišty - ohebné","Flexible Profoam",7.8,1.4,200,{"$f":"VLOOKUP('GLUE CALCULATOR'!B87, 'obliczenia kleju'!$A$5:$B$1060, 2,FALSE)","v":"PRO"}]
[84,"MD355F",null,null,"Podlahové lišty - ohebné","Flexible Profoam",9.6999999999999993,1.8,200,{"$f":"VLOOKUP('GLUE CALCULATOR'!B88, 'obliczenia kleju'!$A$5:$B$1060, 2,FALSE)","v":"PRO"}]
[85,"MD356F",null,null,"Podlahové lišty - ohebné","Flexible Profoam",10.8,1.6,200,{"$f":"VLOOKUP('GLUE CALCULATOR'!B89, 'obliczenia kleju'!$A$5:$B$1060, 2,FALSE)","v":"PRO"}]
[86,"MD358F",null,null,"Podlahové lišty - ohebné","Flexible Profoam",11.7,1.4,200,{"$f":"VLOOKUP('GLUE CALCULATOR'!B90, 'obliczenia kleju'!$A$5:$B$1060, 2,FALSE)","v":"PRO"}]
[87,"MD359F",null,null,"Podlahové lišty - ohebné","Flexible Profoam",7,1.6,200,{"$f":"VLOOKUP('GLUE CALCULATOR'!B91, 'obliczenia kleju'!$A$5:$B$1060, 2,FALSE)","v":"PRO"}]
[88,"MD360F",null,null,"Podlahové lišty - ohebné","Flexible Profoam",13.7,1.8,200,{"$f":"VLOOKUP('GLUE CALCULATOR'!B92, 'obliczenia kleju'!$A$5:$B$1060, 2,FALSE)","v":"PRO"}]
[89,"MD008E",null,null,"Obložky dveří","Polyforce",8,1.7,240,{"$f":"VLOOKUP('GLUE CALCULATOR'!B93, 'obliczenia kleju'!$A$5:$B$1060, 2,FALSE)","v":"PRO"}]
[90,"MD009E",null,null,"Obložky dveří","Polyforce",10,1.7,240,{"$f":"VLOOKUP('GLUE CALCULATOR'!B94, 'obliczenia kleju'!$A$5:$B$1060, 2,FALSE)","v":"PRO"}]
[91,"MD094E",null,null,"Obložky dveří","Polyforce",9.4,1.2,240,{"$f":"VLOOKUP('GLUE CALCULATOR'!B95, 'obliczenia kleju'!$A$5:$B$1060, 2,FALSE)","v":"PRO"}]
[92,"MD258E",null,null,"Obložky dveří","Polyforce",8.1,1,240,{"$f":"VLOOKUP('GLUE CALCULATOR'!B96, 'obliczenia kleju'!$A$5:$B$1060, 2,FALSE)","v":"PRO"}]
[93,"MD356E",null,null,"Obložky dveří","Polyforce",10.8,1.6,240,{"$f":"VLOOKUP('GLUE CALCULATOR'!B97, 'obliczenia kleju'!$A$5:$B$1060, 2,FALSE)","v":"PRO"}]
[94,"MD359E",null,null,"Obložky dveří","Polyforce",7,1.6,240,{"$f":"VLOOKUP('GLUE CALCULATOR'!B98, 'obliczenia kleju'!$A$5:$B$1060, 2,FALSE)","v":"PRO"}]
[95,"QL026",null,null,"Garnýžové lišty","Polyforce",10,4.0999999999999996,240,{"$f":"VLOOKUP('GLUE CALCULATOR'!B99, 'obliczenia kleju'!$A$5:$B$1060, 2,FALSE)","v":"MAX"}]
[96,"QL026H",null,null,"Garnýžové lišty","Polyforce",10,4.0999999999999996,300,{"$f":"VLOOKUP('GLUE CALCULATOR'!B100, 'obliczenia kleju'!$A$5:$B$1060, 2,FALSE)","v":"MAX"}]
[97,"QL026T",null,null,"Garnýžové lišty","Polyforce",10,4.0999999999999996,200,{"$f":"VLOOKUP('GLUE CALCULATOR'!B101, 'obliczenia kleju'!$A$5:$B$1060, 2,FALSE)","v":"MAX"}]
[98,"QL035",null,null,"Garnýžové lišty","Polyforce",12,4,240,{"$f":"VLOOKUP('GLUE CALCULATOR'!B102, 'obliczenia kleju'!$A$5:$B$1060, 2,FALSE)","v":"MAX"}]
[99,"QL035T",null,null,"Garnýžové lišty","Polyforce",12,4,200,{"$f":"VLOOKUP('GLUE CALCULATOR'!B103, 'obliczenia kleju'!$A$5:$B$1060, 2,FALSE)","v":"MAX"}]
[100,"QL035H",null,null,"Garnýžové lišty","Polyforce",12,4,300,{"$f":"VLOOKUP('GLUE CALCULATOR'!B104, 'obliczenia kleju'!$A$5:$B$1060, 2,FALSE)","v":"MAX"}]
[101,"QL036",null,null,"Garnýžové lišty","Polyforce",14.8,4.5999999999999996,240,{"$f":"VLOOKUP('GLUE CALCULATOR'!B105, 'obliczenia kleju'!$A$5:$B$1060, 2,FALSE)","v":"MAX"}]
[102,"QL036T",null,null,"Garnýžové lišty","Polyforce",14.8,4.5999999999999996,200,{"$f":"VLOOKUP('GLUE CALCULATOR'!B106, 'obliczenia kleju'!$A$5:$B$1060, 2,FALSE)","v":"MAX"}]
[103,"QL036H",null,null,"Garnýžové lišty","Polyforce",14.8,4.5999999999999996,300,{"$f":"VLOOKUP('GLUE CALCULATOR'!B107, 'obliczenia kleju'!$A$5:$B$1060, 2,FALSE)","v":"MAX"}]
[104,"QL046",null,null,"Garnýžové lišty","Polyforce",12,5,240,{"$f":"VLOOKUP('GLUE CALCULATOR'!B108, 'obliczenia kleju'!$A$5:$B$1060, 2,FALSE)","v":"MAX"}]
[105,"QL046T",null,null,"Garnýžové lišty","Polyforce",12,5,200,{"$f":"VLOOKUP('GLUE CALCULATOR'!B109, 'obliczenia kleju'!$A$5:$B$1060, 2,FALSE)","v":"MAX"}]
[106,"QL056",null,null,"Garnýžové lišty","Polyforce",17.899999999999999,5.5,240,{"$f":"VLOOKUP('GLUE CALCULATOR'!B110, 'obliczenia kleju'!$A$5:$B$1060, 2,FALSE)","v":"MAX"}]
[107,"QL056T",null,null,"Garnýžové lišty","Polyforce",17.899999999999999,5.5,200,{"$f":"VLOOKUP('GLUE CALCULATOR'!B111, 'obliczenia kleju'!$A$5:$B$1060, 2,FALSE)","v":"MAX"}]
[108,"MD106",null,null,"Stropní lišty","Polyforce",5.7,5.7,200,{"$f":"VLOOKUP('GLUE CALCULATOR'!B112, 'obliczenia kleju'!$A$5:$B$1060, 2,FALSE)","v":"PRO"}]
[109,"MD110",null,null,"Stropní lišty","Polyforce",8.9,10.6,200,{"$f":"VLOOKUP('GLUE CALCULATOR'!B113, 'obliczenia kleju'!$A$5:$B$1060, 2,FALSE)","v":"MAX"}]
[110,"MD111",null,null,"Stropní lišty","Polyforce",9.1999999999999993,6.2,200,{"$f":"VLOOKUP('GLUE CALCULATOR'!B114, 'obliczenia kleju'!$A$5:$B$1060, 2,FALSE)","v":"MAX"}]
[111,"MD137",null,null,"Stropní lišty","Polyforce",9.6,5.5,200,{"$f":"VLOOKUP('GLUE CALCULATOR'!B115, 'obliczenia kleju'!$A$5:$B$1060, 2,FALSE)","v":"MAX"}]
[112,"MD145",null,null,"Stropní lišta","Polyforce",6,6,200,{"$f":"VLOOKUP('GLUE CALCULATOR'!B116, 'obliczenia kleju'!$A$5:$B$1060, 2,FALSE)","v":"PRO"}]
[113,"MD172",null,null,"Stropní lišta","Polyforce",4,4,200,{"$f":"VLOOKUP('GLUE CALCULATOR'!B117, 'obliczenia kleju'!$A$5:$B$1060, 2,FALSE)","v":"PRO"}]
[114,"MD210",null,null,"Stropní lišta","Polyforce",5,5,200,{"$f":"VLOOKUP('GLUE CALCULATOR'!B118, 'obliczenia kleju'!$A$5:$B$1060, 2,FALSE)","v":"PRO"}]
[115,"MD213",null,null,"Stropní lišta","Polyforce",8.1,8.1,200,{"$f":"VLOOKUP('GLUE CALCULATOR'!B119, 'obliczenia kleju'!$A$5:$B$1060, 2,FALSE)","v":"MAX"}]
[116,"MD380",null,null,"Stropní lišta","Polyforce",6.7,6.7,200,{"$f":"VLOOKUP('GLUE CALCULATOR'!B120, 'obliczenia kleju'!$A$5:$B$1060, 2,FALSE)","v":"MAX"}]
[117,"MDA002",null,null,"Stropní lišta","Profoam",7.9,8.8000000000000007,200,{"$f":"VLOOKUP('GLUE CALCULATOR'!B121, 'obliczenia kleju'!$A$5:$B$1060, 2,FALSE)","v":"PRO"}]
[118,"MDA005",null,null,"Stropní lišta","Profoam",5.8,5.8,200,{"$f":"VLOOKUP('GLUE CALCULATOR'!B122, 'obliczenia kleju'!$A$5:$B$1060, 2,FALSE)","v":"PRO"}]
[119,"MDA007",null,null,"Stropní lišta","Profoam",9.8000000000000007,10,200,{"$f":"VLOOKUP('GLUE CALCULATOR'!B123, 'obliczenia kleju'!$A$5:$B$1060, 2,FALSE)","v":"PRO"}]
[120,"MDA008",null,null,"Stropní lišta","Profoam",7.5,7.8,200,{"$f":"VLOOKUP('GLUE CALCULATOR'!B124, 'obliczenia kleju'!$A$5:$B$1060, 2,FALSE)","v":"PRO"}]
[121,"MDA040",null,null,"Stropní lišta","Profoam",13.5,11,200,{"$f":"VLOOKUP('GLUE CALCULATOR'!B125, 'obliczenia kleju'!$A$5:$B$1060, 2,FALSE)","v":"PRO"}]
[122,"MDA046",null,null,"Stropní lišta","Profoam",10.7,12,200,{"$f":"VLOOKUP('GLUE CALCULATOR'!B126, 'obliczenia kleju'!$A$5:$B$1060, 2,FALSE)","v":"PRO"}]
[123,"MDA067",null,null,"Stropní lišta","Profoam",13.3,13.7,200,{"$f":"VLOOKUP('GLUE CALCULATOR'!B127, 'obliczenia kleju'!$A$5:$B$1060, 2,FALSE)","v":"PRO"}]
[124,"MDA072",null,null,"Stropní lišta","Profoam",14.8,6.4,200,{"$f":"VLOOKUP('GLUE CALCULATOR'!B128, 'obliczenia kleju'!$A$5:$B$1060, 2,FALSE)","v":"PRO"}]
[125,"MDA098",null,null,"Stropní lišta","Profoam",11.6,7.4,200,{"$f":"VLOOKUP('GLUE CALCULATOR'!B129, 'obliczenia kleju'!$A$5:$B$1060, 2,FALSE)","v":"PRO"}]
[126,"MDA106",null,null,"Stropní lišta","Profoam",7.5,7.5,200,{"$f":"VLOOKUP('GLUE CALCULATOR'!B130, 'obliczenia kleju'!$A$5:$B$1060, 2,FALSE)","v":"PRO"}]
[127,"MDA109",null,null,"Stropní lišta","Profoam",17,17.8,200,{"$f":"VLOOKUP('GLUE CALCULATOR'!B131, 'obliczenia kleju'!$A$5:$B$1060, 2,FALSE)","v":"PRO"}]
[128,"MDA113",null,null,"Stropní lišta","Profoam",17,17.8,200,{"$f":"VLOOKUP('GLUE CALCULATOR'!B132, 'obliczenia kleju'!$A$5:$B$1060, 2,FALSE)","v":"PRO"}]
[129,"MDA121",null,null,"Stropní lišta","Profoam",7,7.6,200,{"$f":"VLOOKUP('GLUE CALCULATOR'!B133, 'obliczenia kleju'!$A$5:$B$1060, 2,FALSE)","v":"PRO"}]
[130,"MDA138",null,null,"Stropní lišta","Profoam",13,16,200,{"$f":"VLOOKUP('GLUE CALCULATOR'!B134, 'obliczenia kleju'!$A$5:$B$1060, 2,FALSE)","v":"PRO"}]
[131,"MDA212",null,null,"Stropní lišta","Profoam",7.8,4.4000000000000004,200,{"$f":"VLOOKUP('GLUE CALCULATOR'!B135, 'obliczenia kleju'!$A$5:$B$1060, 2,FALSE)","v":"PRO"}]
[132,"MDA401",null,null,"Stropní lišta","Profoam",14.5,16.5,200,{"$f":"VLOOKUP('GLUE CALCULATOR'!B136, 'obliczenia kleju'!$A$5:$B$1060, 2,FALSE)","v":"PRO"}]
[133,"MDB063",null,null,"Stropní lišta","Profoam",4.5,5.5,200,{"$f":"VLOOKUP('GLUE CALCULATOR'!B137, 'obliczenia kleju'!$A$5:$B$1060, 2,FALSE)","v":"PRO"}]
[134,"MDB064",null,null,"Stropní lišta","Profoam",6.4,6.8,200,{"$f":"VLOOKUP('GLUE CALCULATOR'!B138, 'obliczenia kleju'!$A$5:$B$1060, 2,FALSE)","v":"PRO"}]
[135,"MDB080",null,null,"Stropní lišta","Profoam",8,6,200,{"$f":"VLOOKUP('GLUE CALCULATOR'!B139, 'obliczenia kleju'!$A$5:$B$1060, 2,FALSE)","v":"PRO"}]
[136,"MDB100",null,null,"Lišty PRO Led osvětlení","Profoam",10,5,200,{"$f":"VLOOKUP('GLUE CALCULATOR'!B140, 'obliczenia kleju'!$A$5:$B$1060, 2,FALSE)","v":"PRO"}]
[137,"MDB101",null,null,"Lišty PRO Led osvětlení","Profoam",14,10.6,200,{"$f":"VLOOKUP('GLUE CALCULATOR'!B141, 'obliczenia kleju'!$A$5:$B$1060, 2,FALSE)","v":"PRO"}]
[138,"MDB102",null,null,"Stropní lišta","Profoam",8,8,200,{"$f":"VLOOKUP('GLUE CALCULATOR'!B142, 'obliczenia kleju'!$A$5:$B$1060, 2,FALSE)","v":"PRO"}]
[139,"MDB103",null,null,"Stropní lišta","Profoam",18,14,200,{"$f":"VLOOKUP('GLUE CALCULATOR'!B143, 'obliczenia kleju'!$A$5:$B$1060, 2,FALSE)","v":"PRO"}]
[140,"MDB104",null,null,"Stropní lišta","Profoam",16.5,12.4,200,{"$f":"VLOOKUP('GLUE CALCULATOR'!B144, 'obliczenia kleju'!$A$5:$B$1060, 2,FALSE)","v":"PRO"}]
[141,"MDB108",null,null,"Stropní lišta","Profoam",10,10,200,{"$f":"VLOOKUP('GLUE CALCULATOR'!B145, 'obliczenia kleju'!$A$5:$B$1060, 2,FALSE)","v":"PRO"}]
[142,"MDB112",null,null,"Stropní lišta","Profoam",4.4000000000000004,4.4000000000000004,200,{"$f":"VLOOKUP('GLUE CALCULATOR'!B146, 'obliczenia kleju'!$A$5:$B$1060, 2,FALSE)","v":"PRO"}]
[143,"MDB115",null,null,"Lišty PRO Led osvětlení","Profoam",11,6,200,{"$f":"VLOOKUP('GLUE CALCULATOR'!B147, 'obliczenia kleju'!$A$5:$B$1060, 2,FALSE)","v":"PRO"}]
[144,"MDB117",null,null,"Stropní lišta","Profoam",8.3000000000000007,9.1999999999999993,200,{"$f":"VLOOKUP('GLUE CALCULATOR'!B148, 'obliczenia kleju'!$A$5:$B$1060, 2,FALSE)","v":"PRO"}]
[145,"MDB118",null,null,"Stropní lišta","Profoam",9.6999999999999993,10,200,{"$f":"VLOOKUP('GLUE CALCULATOR'!B149, 'obliczenia kleju'!$A$5:$B$1060, 2,FALSE)","v":"PRO"}]
[146,"MDB121",null,null,"Stropní lišta","Profoam",11.6,22.4,200,{"$f":"VLOOKUP('GLUE CALCULATOR'!B150, 'obliczenia kleju'!$A$5:$B$1060, 2,FALSE)","v":"PRO"}]
[147,"MDB123",null,null,"Panel","Profoam",4,4,200,{"$f":"VLOOKUP('GLUE CALCULATOR'!B151, 'obliczenia kleju'!$A$5:$B$1060, 2,FALSE)","v":"PRO"}]
[148,"MDB127",null,null,"Stropní lišta","Profoam",6,13,200,{"$f":"VLOOKUP('GLUE CALCULATOR'!B152, 'obliczenia kleju'!$A$5:$B$1060, 2,FALSE)","v":"PRO"}]
[149,"MDB128",null,null,"Stropní lišta","Profoam",17,17.8,200,{"$f":"VLOOKUP('GLUE CALCULATOR'!B153, 'obliczenia kleju'!$A$5:$B$1060, 2,FALSE)","v":"PRO"}]
[150,"MDB130",null,null,"Stropní lišta","Profoam",5,19,200,{"$f":"VLOOKUP('GLUE CALCULATOR'!B154, 'obliczenia kleju'!$A$5:$B$1060, 2,FALSE)","v":"PRO"}]
[151,"MDB131",null,null,"Stropní lišta","Profoam",9,14,200,{"$f":"VLOOKUP('GLUE CALCULATOR'!B155, 'obliczenia kleju'!$A$5:$B$1060, 2,FALSE)","v":"PRO"}]
[152,"MDB132",null,null,"Stropní lišta","Profoam",5.5,8.6999999999999993,200,{"$f":"VLOOKUP('GLUE CALCULATOR'!B156, 'obliczenia kleju'!$A$5:$B$1060, 2,FALSE)","v":"PRO"}]
[153,"MDB134",null,null,"Stropní lišta","Profoam",8,8,200,{"$f":"VLOOKUP('GLUE CALCULATOR'!B157, 'obliczenia kleju'!$A$5:$B$1060, 2,FALSE)","v":"PRO"}]
[154,"MDB135",null,null,"Stropní lišta","Profoam",2.8,3.5,200,{"$f":"VLOOKUP('GLUE CALCULATOR'!B158, 'obliczenia kleju'!$A$5:$B$1060, 2,FALSE)","v":"PRO"}]
[155,"MDB136",null,null,"Stropní lišta","Profoam",4,4,200,{"$f":"VLOOKUP('GLUE CALCULATOR'!B159, 'obliczenia kleju'!$A$5:$B$1060, 2,FALSE)","v":"PRO"}]
[156,"MDB140",null,null,"Stropní lišta","Profoam",15,16,200,{"$f":"VLOOKUP('GLUE CALCULATOR'!B160, 'obliczenia kleju'!$A$5:$B$1060, 2,FALSE)","v":"PRO"}]
[157,"MDB142",null,null,"Stropní lišta","Profoam",9.8000000000000007,8,200,{"$f":"VLOOKUP('GLUE CALCULATOR'!B161, 'obliczenia kleju'!$A$5:$B$1060, 2,FALSE)","v":"PRO"}]
[158,"MDB147",null,null,"Stropní lišta","Profoam",5,5.5,200,{"$f":"VLOOKUP('GLUE CALCULATOR'!B162, 'obliczenia kleju'!$A$5:$B$1060, 2,FALSE)","v":"PRO"}]
[159,"MDB150",null,null,"Stropní lišta","Profoam",15,4,200,{"$f":"VLOOKUP('GLUE CALCULATOR'!B163, 'obliczenia kleju'!$A$5:$B$1060, 2,FALSE)","v":"PRO"}]
[160,"MDB152",null,null,"Stropní lišta","Profoam",7.6,7.6,200,{"$f":"VLOOKUP('GLUE CALCULATOR'!B164, 'obliczenia kleju'!$A$5:$B$1060, 2,FALSE)","v":"PRO"}]
[161,"MDB154",null,null,"Stropní lišta","Profoam",15,12.5,200,{"$f":"VLOOKUP('GLUE CALCULATOR'!B165, 'obliczenia kleju'!$A$5:$B$1060, 2,FALSE)","v":"PRO"}]
[162,"MDB155",null,null,"Stropní lišta","Profoam",21.6,21.6,200,{"$f":"VLOOKUP('GLUE CALCULATOR'!B166, 'obliczenia kleju'!$A$5:$B$1060, 2,FALSE)","v":"PRO"}]
[163,"MDB158",null,null,"Stropní lišta","Profoam",10.5,12.5,200,{"$f":"VLOOKUP('GLUE CALCULATOR'!B167, 'obliczenia kleju'!$A$5:$B$1060, 2,FALSE)","v":"PRO"}]
[164,"MDB162",null,null,"Stropní lišta","Profoam",3.2,10.5,200,{"$f":"VLOOKUP('GLUE CALCULATOR'!B168, 'obliczenia kleju'!$A$5:$B$1060, 2,FALSE)","v":"PRO"}]
[165,"MDB163",null,null,"Stropní lišta","Profoam",3.2,16,200,{"$f":"VLOOKUP('GLUE CALCULATOR'!B169, 'obliczenia kleju'!$A$5:$B$1060, 2,FALSE)","v":"PRO"}]
[166,"MDB164",null,null,"Stropní lišta","Profoam",2.1,6.2,200,{"$f":"VLOOKUP('GLUE CALCULATOR'!B170, 'obliczenia kleju'!$A$5:$B$1060, 2,FALSE)","v":"PRO"}]
[167,"MDB165",null,null,"Stropní lišta","Profoam",2.1,9.8000000000000007,200,{"$f":"VLOOKUP('GLUE CALCULATOR'!B171, 'obliczenia kleju'!$A$5:$B$1060, 2,FALSE)","v":"PRO"}]
[168,"MDB167",null,null,"Stropní lišta","Profoam",5.5,5.5,200,{"$f":"VLOOKUP('GLUE CALCULATOR'!B172, 'obliczenia kleju'!$A$5:$B$1060, 2,FALSE)","v":"PRO"}]
[169,"MDB169",null,null,"Stropní lišta","Profoam",12.4,12.6,200,{"$f":"VLOOKUP('GLUE CALCULATOR'!B173, 'obliczenia kleju'!$A$5:$B$1060, 2,FALSE)","v":"PRO"}]
[170,"MDB174",null,null,"Stropní lišta","Profoam",4.9000000000000004,5.2,200,{"$f":"VLOOKUP('GLUE CALCULATOR'!B174, 'obliczenia kleju'!$A$5:$B$1060, 2,FALSE)","v":"PRO"}]
[171,"MDB180",null,null,"Stropní lišta","Profoam",2.5,1.5,200,{"$f":"VLOOKUP('GLUE CALCULATOR'!B175, 'obliczenia kleju'!$A$5:$B$1060, 2,FALSE)","v":"PRO"}]
[172,"MDB185",null,null,"Stropní lišta","Profoam",6.4,6.1,200,{"$f":"VLOOKUP('GLUE CALCULATOR'!B176, 'obliczenia kleju'!$A$5:$B$1060, 2,FALSE)","v":"PRO"}]
[173,"MDB214",null,null,"Stropní lišta","Profoam",14.5,14.6,200,{"$f":"VLOOKUP('GLUE CALCULATOR'!B177, 'obliczenia kleju'!$A$5:$B$1060, 2,FALSE)","v":"PRO"}]
[174,"MD106F",null,null,"Stropní lišta - ohebná","Flexible Profoam",5.7,5.7,200,{"$f":"VLOOKUP('GLUE CALCULATOR'!B178, 'obliczenia kleju'!$A$5:$B$1060, 2,FALSE)","v":"PRO"}]
[175,"MD145F",null,null,"Stropní lišta - ohebná","Flexible Profoam",6,6,200,{"$f":"VLOOKUP('GLUE CALCULATOR'!B179, 'obliczenia kleju'!$A$5:$B$1060, 2,FALSE)","v":"PRO"}]
[176,"MD213F",null,null,"Stropní lišta - ohebná","Flexible Profoam",8.1,8.1,200,{"$f":"VLOOKUP('GLUE CALCULATOR'!B180, 'obliczenia kleju'!$A$5:$B$1060, 2,FALSE)","v":"MAX"}]
[177,"MDA005F",null,null,"Stropní lišta - ohebná","Flexible Profoam",5.8,5.8,200,{"$f":"VLOOKUP('GLUE CALCULATOR'!B181, 'obliczenia kleju'!$A$5:$B$1060, 2,FALSE)","v":"PRO"}]
[178,"MDB102F",null,null,"Stropní lišta - ohebná","Flexible Profoam",8,8,200,{"$f":"VLOOKUP('GLUE CALCULATOR'!B182, 'obliczenia kleju'!$A$5:$B$1060, 2,FALSE)","v":"PRO"}]
[179,"MDB108F",null,null,"Stropní lišta - ohebná","Flexible Profoam",10,10,200,{"$f":"VLOOKUP('GLUE CALCULATOR'!B183, 'obliczenia kleju'!$A$5:$B$1060, 2,FALSE)","v":"PRO"}]
[180,"MDB110F",null,null,"Stropní lišta - ohebná","Flexible Profoam",9,11,200,{"$f":"VLOOKUP('GLUE CALCULATOR'!B184, 'obliczenia kleju'!$A$5:$B$1060, 2,FALSE)","v":"MAX"}]
[181,"MDB112F",null,null,"Stropní lišta - ohebná","Flexible Profoam",4.4000000000000004,4.4000000000000004,200,{"$f":"VLOOKUP('GLUE CALCULATOR'!B185, 'obliczenia kleju'!$A$5:$B$1060, 2,FALSE)","v":"PRO"}]
[182,"MDB118F",null,null,"Stropní lišta - ohebná","Flexible Profoam",9.6999999999999993,10,200,{"$f":"VLOOKUP('GLUE CALCULATOR'!B186, 'obliczenia kleju'!$A$5:$B$1060, 2,FALSE)","v":"PRO"}]
[183,"MDB135F",null,null,"Stropní lišta - ohebná","Flexible Profoam",2.8,3.5,200,{"$f":"VLOOKUP('GLUE CALCULATOR'!B187, 'obliczenia kleju'!$A$5:$B$1060, 2,FALSE)","v":"PRO"}]
[184,"MDB169F",null,null,"Stropní lišta - ohebná","Flexible Profoam",12.4,12.6,200,{"$f":"VLOOKUP('GLUE CALCULATOR'!B188, 'obliczenia kleju'!$A$5:$B$1060, 2,FALSE)","v":"PRO"}]
[185,"MDB172F",null,null,"Stropní lišta - ohebná","Flexible Profoam",4,4,200,{"$f":"VLOOKUP('GLUE CALCULATOR'!B189, 'obliczenia kleju'!$A$5:$B$1060, 2,FALSE)","v":"PRO"}]
[186,"MDB210F",null,null,"Stropní lišta - ohebná","Flexible Profoam",5.0999999999999996,4.8,200,{"$f":"VLOOKUP('GLUE CALCULATOR'!B190, 'obliczenia kleju'!$A$5:$B$1060, 2,FALSE)","v":"PRO"}]
[187,"MD002",null,null,"Panel","Polyforce",4,1.8,200,{"$f":"VLOOKUP('GLUE CALCULATOR'!B191, 'obliczenia kleju'!$A$5:$B$1060, 2,FALSE)","v":"PRO"}]
[188,"MD003",null,null,"Panel","Polyforce",2.2000000000000002,1,200,{"$f":"VLOOKUP('GLUE CALCULATOR'!B192, 'obliczenia kleju'!$A$5:$B$1060, 2,FALSE)","v":"PRO"}]
[189,"MD007",null,null,"Panel","Polyforce",7.3,2.2999999999999998,200,{"$f":"VLOOKUP('GLUE CALCULATOR'!B193, 'obliczenia kleju'!$A$5:$B$1060, 2,FALSE)","v":"PRO"}]
[190,"MD010",null,null,"Panel","Polyforce",1.5,1.5,200,{"$f":"VLOOKUP('GLUE CALCULATOR'!B194, 'obliczenia kleju'!$A$5:$B$1060, 2,FALSE)","v":"PRO"}]
[191,"MD012",null,null,"Panel","Polyforce",2,0.5,200,{"$f":"VLOOKUP('GLUE CALCULATOR'!B195, 'obliczenia kleju'!$A$5:$B$1060, 2,FALSE)","v":"PRO"}]
[192,"MD026",null,null,"Panel","Polyforce",4.5,1.5,200,{"$f":"VLOOKUP('GLUE CALCULATOR'!B196, 'obliczenia kleju'!$A$5:$B$1060, 2,FALSE)","v":"PRO"}]
[193,"MD031",null,null,"Panel","Polyforce",3,1,200,{"$f":"VLOOKUP('GLUE CALCULATOR'!B197, 'obliczenia kleju'!$A$5:$B$1060, 2,FALSE)","v":"PRO"}]
[194,"MD237",null,null,"Panel","Polyforce",3,3,200,{"$f":"VLOOKUP('GLUE CALCULATOR'!B198, 'obliczenia kleju'!$A$5:$B$1060, 2,FALSE)","v":"PRO"}]
[195,"MD255",null,null,"Panel","Polyforce",3.9,2,200,{"$f":"VLOOKUP('GLUE CALCULATOR'!B199, 'obliczenia kleju'!$A$5:$B$1060, 2,FALSE)","v":"PRO"}]
[196,"MD308",null,null,"Panel","Polyforce",6.5,2.1,200,{"$f":"VLOOKUP('GLUE CALCULATOR'!B200, 'obliczenia kleju'!$A$5:$B$1060, 2,FALSE)","v":"PRO"}]
[197,"MD314",null,null,"Panel","Polyforce",5.2,1.7,200,{"$f":"VLOOKUP('GLUE CALCULATOR'!B201, 'obliczenia kleju'!$A$5:$B$1060, 2,FALSE)","v":"PRO"}]
[198,"MD317",null,null,"Panel","Polyforce",4.5,1.5,200,{"$f":"VLOOKUP('GLUE CALCULATOR'!B202, 'obliczenia kleju'!$A$5:$B$1060, 2,FALSE)","v":"PRO"}]
[199,"MD318",null,null,"Panel","Polyforce",3.3,1.5,200,{"$f":"VLOOKUP('GLUE CALCULATOR'!B203, 'obliczenia kleju'!$A$5:$B$1060, 2,FALSE)","v":"PRO"}]
[200,"MD325",null,null,"Panel","Polyforce",4.0999999999999996,1.5,200,{"$f":"VLOOKUP('GLUE CALCULATOR'!B204, 'obliczenia kleju'!$A$5:$B$1060, 2,FALSE)","v":"PRO"}]
[201,"MD332",null,null,"Panel","Polyforce",4.0999999999999996,1.7,200,{"$f":"VLOOKUP('GLUE CALCULATOR'!B205, 'obliczenia kleju'!$A$5:$B$1060, 2,FALSE)","v":"PRO"}]
[202,"MD338",null,null,"Panel","Polyforce",8,2.1,200,{"$f":"VLOOKUP('GLUE CALCULATOR'!B206, 'obliczenia kleju'!$A$5:$B$1060, 2,FALSE)","v":"PRO"}]
[203,"MD346",null,null,"Panel","Polyforce",6.1,2.2999999999999998,200,{"$f":"VLOOKUP('GLUE CALCULATOR'!B207, 'obliczenia kleju'!$A$5:$B$1060, 2,FALSE)","v":"PRO"}]
[204,"MD413",null,null,"Panel","Polyforce",2.5,1.2,200,{"$f":"VLOOKUP('GLUE CALCULATOR'!B208, 'obliczenia kleju'!$A$5:$B$1060, 2,FALSE)","v":"PRO"}]
[205,"MDC217",null,null,"Panel","Profoam",7.8,1.3,200,{"$f":"VLOOKUP('GLUE CALCULATOR'!B209, 'obliczenia kleju'!$A$5:$B$1060, 2,FALSE)","v":"PRO"}]
[206,"MDC236",null,null,"Panel","Profoam",12.8,1.4,200,{"$f":"VLOOKUP('GLUE CALCULATOR'!B210, 'obliczenia kleju'!$A$5:$B$1060, 2,FALSE)","v":"PRO"}]
[207,"MDC239",null,null,"Panel","Profoam",7.5,1.5,200,{"$f":"VLOOKUP('GLUE CALCULATOR'!B211, 'obliczenia kleju'!$A$5:$B$1060, 2,FALSE)","v":"PRO"}]
[208,"MDC250",null,null,"Panel","Profoam",8.1,1.5,200,{"$f":"VLOOKUP('GLUE CALCULATOR'!B212, 'obliczenia kleju'!$A$5:$B$1060, 2,FALSE)","v":"PRO"}]
[209,"MDC252",null,null,"Panel","Profoam",5.4,2.2999999999999998,200,{"$f":"VLOOKUP('GLUE CALCULATOR'!B213, 'obliczenia kleju'!$A$5:$B$1060, 2,FALSE)","v":"PRO"}]
[210,"MDC255",null,null,"Panel","Profoam",5,1.6,200,{"$f":"VLOOKUP('GLUE CALCULATOR'!B214, 'obliczenia kleju'!$A$5:$B$1060, 2,FALSE)","v":"PRO"}]
[211,"MDC258",null,null,"Panel","Profoam",5.4,2,200,{"$f":"VLOOKUP('GLUE CALCULATOR'!B215, 'obliczenia kleju'!$A$5:$B$1060, 2,FALSE)","v":"PRO"}]
[212,"MDD305",null,null,"Panel","Profoam",9,3,200,{"$f":"VLOOKUP('GLUE CALCULATOR'!B216, 'obliczenia kleju'!$A$5:$B$1060, 2,FALSE)","v":"PRO"}]
[213,"MDD311",null,null,"Panel","Profoam",8.5,2.5,200,{"$f":"VLOOKUP('GLUE CALCULATOR'!B217, 'obliczenia kleju'!$A$5:$B$1060, 2,FALSE)","v":"PRO"}]
[214,"MDD315",null,null,"Panel","Profoam",22,6.6,200,{"$f":"VLOOKUP('GLUE CALCULATOR'!B218, 'obliczenia kleju'!$A$5:$B$1060, 2,FALSE)","v":"PRO"}]
[215,"MDD316",null,null,"Panel","Profoam",1.5,0.5,200,{"$f":"VLOOKUP('GLUE CALCULATOR'!B219, 'obliczenia kleju'!$A$5:$B$1060, 2,FALSE)","v":"PRO"}]
[216,"MDD332",null,null,"Panel","Profoam",4.0999999999999996,1.7,200,{"$f":"VLOOKUP('GLUE CALCULATOR'!B220, 'obliczenia kleju'!$A$5:$B$1060, 2,FALSE)","v":"PRO"}]
[217,"MDD334",null,null,"Panel","Profoam",10.1,3.3,200,{"$f":"VLOOKUP('GLUE CALCULATOR'!B221, 'obliczenia kleju'!$A$5:$B$1060, 2,FALSE)","v":"PRO"}]
[218,"MDD335",null,null,"Panel","Profoam",15.5,5.4,200,{"$f":"VLOOKUP('GLUE CALCULATOR'!B222, 'obliczenia kleju'!$A$5:$B$1060, 2,FALSE)","v":"PRO"}]
[219,"MDD338",null,null,"Panel","Profoam",8,2.1,200,{"$f":"VLOOKUP('GLUE CALCULATOR'!B223, 'obliczenia kleju'!$A$5:$B$1060, 2,FALSE)","v":"PRO"}]
[220,"MDD339",null,null,"Panel","Profoam",8.1,1.9,200,{"$f":"VLOOKUP('GLUE CALCULATOR'!B224, 'obliczenia kleju'!$A$5:$B$1060, 2,FALSE)","v":"PRO"}]
[221,"MDD345",null,null,"Panel","Profoam",10.199999999999999,2.4,200,{"$f":"VLOOKUP('GLUE CALCULATOR'!B225, 'obliczenia kleju'!$A$5:$B$1060, 2,FALSE)","v":"PRO"}]
[222,"MDD351",null,null,"Panel","Profoam",7.6,2.5,200,{"$f":"VLOOKUP('GLUE CALCULATOR'!B226, 'obliczenia kleju'!$A$5:$B$1060, 2,FALSE)","v":"PRO"}]
[223,"MDD410",null,null,"Panel","Profoam",10.8,2,200,{"$f":"VLOOKUP('GLUE CALCULATOR'!B227, 'obliczenia kleju'!$A$5:$B$1060, 2,FALSE)","v":"PRO"}]
[224,"MDD412",null,null,"Panel","Profoam",7.5,1.8,200,{"$f":"VLOOKUP('GLUE CALCULATOR'!B228, 'obliczenia kleju'!$A$5:$B$1060, 2,FALSE)","v":"PRO"}]
[225,"MDD414",null,null,"Panel","Profoam",5.0999999999999996,1.1000000000000001,200,{"$f":"VLOOKUP('GLUE CALCULATOR'!B229, 'obliczenia kleju'!$A$5:$B$1060, 2,FALSE)","v":"PRO"}]
[226,"QL022",null,null,"Panel","Polyforce",2,1,200,{"$f":"VLOOKUP('GLUE CALCULATOR'!B230, 'obliczenia kleju'!$A$5:$B$1060, 2,FALSE)","v":"PRO"}]
[227,"QL023",null,null,"Panel","Polyforce",4,1.9,200,{"$f":"VLOOKUP('GLUE CALCULATOR'!B231, 'obliczenia kleju'!$A$5:$B$1060, 2,FALSE)","v":"PRO"}]
[228,"MD308F",null,null,"Panel - ohebný","Flexible Profoam",6.5,2.1,200,{"$f":"VLOOKUP('GLUE CALCULATOR'!B232, 'obliczenia kleju'!$A$5:$B$1060, 2,FALSE)","v":"PRO"}]
[229,"MD314F",null,null,"Panel - ohebný","Flexible Profoam",5.2,1.7,200,{"$f":"VLOOKUP('GLUE CALCULATOR'!B233, 'obliczenia kleju'!$A$5:$B$1060, 2,FALSE)","v":"PRO"}]
[230,"MD325F",null,null,"Panel - ohebný","Flexible Profoam",1.5,4.0999999999999996,200,{"$f":"VLOOKUP('GLUE CALCULATOR'!B234, 'obliczenia kleju'!$A$5:$B$1060, 2,FALSE)","v":"PRO"}]
[231,"MD338F",null,null,"Panel - ohebný","Flexible Profoam",8,2.1,200,{"$f":"VLOOKUP('GLUE CALCULATOR'!B235, 'obliczenia kleju'!$A$5:$B$1060, 2,FALSE)","v":"PRO"}]
[232,"MDC239F",null,null,"Panel - ohebný","Flexible Profoam",7.5,1.5,200,{"$f":"VLOOKUP('GLUE CALCULATOR'!B236, 'obliczenia kleju'!$A$5:$B$1060, 2,FALSE)","v":"PRO"}]
[233,"MDC250F",null,null,"Panel - ohebný","Flexible Profoam",8.1,1.5,200,{"$f":"VLOOKUP('GLUE CALCULATOR'!B237, 'obliczenia kleju'!$A$5:$B$1060, 2,FALSE)","v":"PRO"}]
[234,"MDC252F",null,null,"Panel - ohebný","Flexible Profoam",5.4,2.2999999999999998,200,{"$f":"VLOOKUP('GLUE CALCULATOR'!B238, 'obliczenia kleju'!$A$5:$B$1060, 2,FALSE)","v":"PRO"}]
[235,"MDC258F",null,null,"Panel - ohebný","Flexible Profoam",5.4,2,200,{"$f":"VLOOKUP('GLUE CALCULATOR'!B239, 'obliczenia kleju'!$A$5:$B$1060, 2,FALSE)","v":"PRO"}]
[236,"MDD311F",null,null,"Panel - ohebný","Flexible Profoam",8.5,2.5,200,{"$f":"VLOOKUP('GLUE CALCULATOR'!B240, 'obliczenia kleju'!$A$5:$B$1060, 2,FALSE)","v":"PRO"}]
[237,"MDD332F",null,null,"Panel - ohebný","Flexible Profoam",4.0999999999999996,1.7,200,{"$f":"VLOOKUP('GLUE CALCULATOR'!B241, 'obliczenia kleju'!$A$5:$B$1060, 2,FALSE)","v":"PRO"}]
[238,"MDD338F",null,null,"Panel - ohebný","Flexible Profoam",8,2.1,200,{"$f":"VLOOKUP('GLUE CALCULATOR'!B242, 'obliczenia kleju'!$A$5:$B$1060, 2,FALSE)","v":"PRO"}]
[239,"MDD339F",null,null,"Panel - ohebný","Flexible Profoam",8.1,1.9,200,{"$f":"VLOOKUP('GLUE CALCULATOR'!B243, 'obliczenia kleju'!$A$5:$B$1060, 2,FALSE)","v":"PRO"}]
[240,"MDD345F",null,null,"Panel - ohebný","Flexible Profoam",10.199999999999999,2.4,200,{"$f":"VLOOKUP('GLUE CALCULATOR'!B244, 'obliczenia kleju'!$A$5:$B$1060, 2,FALSE)","v":"PRO"}]
[241,"MDD346F",null,null,"Panel - ohebný","Flexible Profoam",6.1,2.5,200,{"$f":"VLOOKUP('GLUE CALCULATOR'!B245, 'obliczenia kleju'!$A$5:$B$1060, 2,FALSE)","v":"PRO"}]
[242,"MDD414F",null,null,"Panel - ohebný","Flexible Profoam",5.0999999999999996,1.1000000000000001,200,{"$f":"VLOOKUP('GLUE CALCULATOR'!B246, 'obliczenia kleju'!$A$5:$B$1060, 2,FALSE)","v":"PRO"}]
[243,"MD070",null,null,"Lišty PRO Led osvětlení","Polyforce",7.2,4,200,{"$f":"VLOOKUP('GLUE CALCULATOR'!B247, 'obliczenia kleju'!$A$5:$B$1060, 2,FALSE)","v":"PRO"}]
[244,"MD105",null,null,"Lišty PRO Led osvětlení","Polyforce",10.8,12,200,{"$f":"VLOOKUP('GLUE CALCULATOR'!B248, 'obliczenia kleju'!$A$5:$B$1060, 2,FALSE)","v":"MAX"}]
[245,"MD105H",null,null,"Lišty PRO Led osvětlení","Polyforce",10.8,12,300,{"$f":"VLOOKUP('GLUE CALCULATOR'!B249, 'obliczenia kleju'!$A$5:$B$1060, 2,FALSE)","v":"MAX"}]
[246,"MD118",null,null,"Lišty PRO Led osvětlení","Polyforce",7,2.7,200,{"$f":"VLOOKUP('GLUE CALCULATOR'!B250, 'obliczenia kleju'!$A$5:$B$1060, 2,FALSE)","v":"PRO"}]
[247,"MD156",null,null,"Lišty PRO Led osvětlení","Polyforce",11,14.5,200,{"$f":"VLOOKUP('GLUE CALCULATOR'!B251, 'obliczenia kleju'!$A$5:$B$1060, 2,FALSE)","v":"MAX"}]
[248,"MD161",null,null,"Lišty PRO Led osvětlení","Polyforce",9.1999999999999993,8.3000000000000007,200,{"$f":"VLOOKUP('GLUE CALCULATOR'!B252, 'obliczenia kleju'!$A$5:$B$1060, 2,FALSE)","v":"MAX"}]
[249,"MD362",null,null,"Lišty PRO Led osvětlení","Polyforce",17.2,8.6,200,{"$f":"VLOOKUP('GLUE CALCULATOR'!B253, 'obliczenia kleju'!$A$5:$B$1060, 2,FALSE)","v":"MAX"}]
[250,"MD367",null,null,"Lišty PRO Led osvětlení","Polyforce",7.2,7,200,{"$f":"VLOOKUP('GLUE CALCULATOR'!B254, 'obliczenia kleju'!$A$5:$B$1060, 2,FALSE)","v":"MAX"}]
[251,"MD368",null,null,"Lišty PRO Led osvětlení","Polyforce",5.0999999999999996,5.0999999999999996,200,{"$f":"VLOOKUP('GLUE CALCULATOR'!B255, 'obliczenia kleju'!$A$5:$B$1060, 2,FALSE)","v":"PRO"}]
[252,"QL001",null,null,"Lišty PRO Led osvětlení","Polyforce",14.7,14.7,200,{"$f":"VLOOKUP('GLUE CALCULATOR'!B256, 'obliczenia kleju'!$A$5:$B$1060, 2,FALSE)","v":"PRO"}]
[253,"QL002",null,null,"Lišty PRO Led osvětlení","Polyforce",8.5,8.5,200,{"$f":"VLOOKUP('GLUE CALCULATOR'!B257, 'obliczenia kleju'!$A$5:$B$1060, 2,FALSE)","v":"PRO"}]
[254,"QL006",null,null,"Lišty PRO Led osvětlení","Polyforce",7,4.2,200,{"$f":"VLOOKUP('GLUE CALCULATOR'!B258, 'obliczenia kleju'!$A$5:$B$1060, 2,FALSE)","v":"PRO"}]
[255,"QL007",null,null,"Lišty PRO Led osvětlení","Polyforce",9.3000000000000007,4,200,{"$f":"VLOOKUP('GLUE CALCULATOR'!B259, 'obliczenia kleju'!$A$5:$B$1060, 2,FALSE)","v":"PRO"}]
[256,"QL009",null,null,"Lišty PRO Led osvětlení","Polyforce",12,4.7,200,{"$f":"VLOOKUP('GLUE CALCULATOR'!B260, 'obliczenia kleju'!$A$5:$B$1060, 2,FALSE)","v":"PRO"}]
[257,"QL010",null,null,"Lišty PRO Led osvětlení","Polyforce",12,4.2,200,{"$f":"VLOOKUP('GLUE CALCULATOR'!B261, 'obliczenia kleju'!$A$5:$B$1060, 2,FALSE)","v":"PRO"}]
[258,"QL011",null,null,"Lišty PRO Led osvětlení","Polyforce",9.5,12.3,200,{"$f":"VLOOKUP('GLUE CALCULATOR'!B262, 'obliczenia kleju'!$A$5:$B$1060, 2,FALSE)","v":"MAX"}]
[259,"QL017",null,null,"Lišty PRO Led osvětlení","Polyforce",10,2.5,200,{"$f":"VLOOKUP('GLUE CALCULATOR'!B263, 'obliczenia kleju'!$A$5:$B$1060, 2,FALSE)","v":"PRO"}]
[260,"QL019",null,null,"Lišty PRO Led osvětlení","Polyforce",8,2.5,200,{"$f":"VLOOKUP('GLUE CALCULATOR'!B264, 'obliczenia kleju'!$A$5:$B$1060, 2,FALSE)","v":"PRO"}]
[261,"QL021",null,null,"Podlahové lišty","Polyforce",2,2.5,200,{"$f":"VLOOKUP('GLUE CALCULATOR'!B265, 'obliczenia kleju'!$A$5:$B$1060, 2,FALSE)","v":"PRO"}]
[262,"QL024",null,null,"Lišty PRO Led osvětlení","Polyforce",8.5,3,200,{"$f":"VLOOKUP('GLUE CALCULATOR'!B266, 'obliczenia kleju'!$A$5:$B$1060, 2,FALSE)","v":"MAX"}]
[263,"QL025",null,null,"Lišty PRO Led osvětlení","Polyforce",11,6,200,{"$f":"VLOOKUP('GLUE CALCULATOR'!B267, 'obliczenia kleju'!$A$5:$B$1060, 2,FALSE)","v":"MAX"}]
[264,"QL027",null,null,"Lišty PRO Led osvětlení","Polyforce",11,11,200,{"$f":"VLOOKUP('GLUE CALCULATOR'!B268, 'obliczenia kleju'!$A$5:$B$1060, 2,FALSE)","v":"MAX"}]
[265,"BW001T",null,null,"Dekorativní panel","Polyforce",1.2,12,200,{"$f":"VLOOKUP('GLUE CALCULATOR'!B269, 'obliczenia kleju'!$A$5:$B$1060, 2,FALSE)","v":"PRO"}]
[266,"BW001LT",null,null,"Dekorativní panel - levý","Polyforce",1.2,12,200,{"$f":"VLOOKUP('GLUE CALCULATOR'!B270, 'obliczenia kleju'!$A$5:$B$1060, 2,FALSE)","v":"PRO"}]
[267,"BW001RT",null,null,"Dekorativní panel - pravý","Polyforce",1.2,12,200,{"$f":"VLOOKUP('GLUE CALCULATOR'!B271, 'obliczenia kleju'!$A$5:$B$1060, 2,FALSE)","v":"PRO"}]
[268,"TP001",null,null,"Dekorativní panel - zakončovací lišta","Polyforce",1.2,2,200,{"$f":"VLOOKUP('GLUE CALCULATOR'!B272, 'obliczenia kleju'!$A$5:$B$1060, 2,FALSE)","v":"PRO"}]
[269,"TP002",null,null,"Dekorativní panel - zakončovací lišta","Polyforce",1.2,2,200,{"$f":"VLOOKUP('GLUE CALCULATOR'!B273, 'obliczenia kleju'!$A$5:$B$1060, 2,FALSE)","v":"PRO"}]
[270,"TP003",null,null,"Dekorativní panel - zakončovací lišta","Polyforce",1.1499999999999999,2,200,{"$f":"VLOOKUP('GLUE CALCULATOR'!B274, 'obliczenia kleju'!$A$5:$B$1060, 2,FALSE)","v":"PRO"}]
[271,"TP004",null,null,"Dekorativní panel - zakončovací lišta","Polyforce",2.9,1.8,200,{"$f":"VLOOKUP('GLUE CALCULATOR'!B275, 'obliczenia kleju'!$A$5:$B$1060, 2,FALSE)","v":"PRO"}]
[272,"TP005",null,null,"Dekorativní panel - zakončovací lišta","Polyforce",2.73,2.7,200,{"$f":"VLOOKUP('GLUE CALCULATOR'!B276, 'obliczenia kleju'!$A$5:$B$1060, 2,FALSE)","v":"PRO"}]
[273,"BW001TP",null,null,"Dekorativní panel - premium","Polyforce",1.2,12,200,{"$f":"VLOOKUP('GLUE CALCULATOR'!B277, 'obliczenia kleju'!$A$5:$B$1060, 2,FALSE)","v":"PRO"}]
[274,"BW001LTP",null,null,"Premium dekorativní panel - levý","Polyforce",1.2,12,200,{"$f":"VLOOKUP('GLUE CALCULATOR'!B278, 'obliczenia kleju'!$A$5:$B$1060, 2,FALSE)","v":"PRO"}]
[275,"BW001RTP",null,null,"Premium dekorativní panel - pravý","Polyforce",1.2,12,200,{"$f":"VLOOKUP('GLUE CALCULATOR'!B279, 'obliczenia kleju'!$A$5:$B$1060, 2,FALSE)","v":"PRO"}]
[276,"TP001P",null,null,"Premium dekorativní panel - zakončovací lišta","Polyforce",1.2,2,200,{"$f":"VLOOKUP('GLUE CALCULATOR'!B280, 'obliczenia kleju'!$A$5:$B$1060, 2,FALSE)","v":"PRO"}]
[277,"TP002P",null,null,"Premium dekorativní panel - zakončovací lišta","Polyforce",1.2,2,200,{"$f":"VLOOKUP('GLUE CALCULATOR'!B281, 'obliczenia kleju'!$A$5:$B$1060, 2,FALSE)","v":"PRO"}]
[278,"TP003P",null,null,"Premium dekorativní panel - zakončovací lišta","Polyforce",1.1499999999999999,2,200,{"$f":"VLOOKUP('GLUE CALCULATOR'!B282, 'obliczenia kleju'!$A$5:$B$1060, 2,FALSE)","v":"PRO"}]
[279,"TP004P",null,null,"Premium dekorativní panel - zakončovací lišta","Polyforce",2.9,1.8,200,{"$f":"VLOOKUP('GLUE CALCULATOR'!B283, 'obliczenia kleju'!$A$5:$B$1060, 2,FALSE)","v":"PRO"}]
[280,"TP005P",null,null,"Premium dekorativní panel - zakončovací lišta","Polyforce",2.73,2.7,200,{"$f":"VLOOKUP('GLUE CALCULATOR'!B284, 'obliczenia kleju'!$A$5:$B$1060, 2,FALSE)","v":"PRO"}]
[281,"WP001",null,null,"Panel Duna","Polyforce",1.32,24.7,270,{"$f":"VLOOKUP('GLUE CALCULATOR'!B285, 'obliczenia kleju'!$A$5:$B$1060, 2,FALSE)","v":"PRO"}]
[282,"WP001R",null,null,"Panel Duna - pravý","Polyforce",1.32,3.1,270,{"$f":"VLOOKUP('GLUE CALCULATOR'!B286, 'obliczenia kleju'!$A$5:$B$1060, 2,FALSE)","v":"PRO"}]
[283,"WP001L",null,null,"Pavel Duna - levý","Polyforce",1.32,3.1,270,{"$f":"VLOOKUP('GLUE CALCULATOR'!B287, 'obliczenia kleju'!$A$5:$B$1060, 2,FALSE)","v":"PRO"}]
[284,"WP001T",null,null,"Panel Duna","Polyforce",1.32,24.7,200,{"$f":"VLOOKUP('GLUE CALCULATOR'!B288, 'obliczenia kleju'!$A$5:$B$1060, 2,FALSE)","v":"PRO"}]
[285,"WP001RT",null,null,"Panel Duna - pravý","Polyforce",1.32,3.1,200,{"$f":"VLOOKUP('GLUE CALCULATOR'!B289, 'obliczenia kleju'!$A$5:$B$1060, 2,FALSE)","v":"PRO"}]
[286,"WP001LT",null,null,"Panel Duna - levý","Polyforce",1.32,3.1,200,{"$f":"VLOOKUP('GLUE CALCULATOR'!B290, 'obliczenia kleju'!$A$5:$B$1060, 2,FALSE)","v":"PRO"}]
[287,"WP002",null,null,"Panel Lumio","Polyforce",1.1499999999999999,24.7,270,{"$f":"VLOOKUP('GLUE CALCULATOR'!B291, 'obliczenia kleju'!$A$5:$B$1060, 2,FALSE)","v":"PRO"}]
[288,"WP002R",null,null,"Panel Lumio - pravý","Polyforce",1.1499999999999999,3.1,270,{"$f":"VLOOKUP('GLUE CALCULATOR'!B292, 'obliczenia kleju'!$A$5:$B$1060, 2,FALSE)","v":"PRO"}]
[289,"WP002L",null,null,"Panel Lumio - levý","Polyforce",1.1499999999999999,3.1,270,{"$f":"VLOOKUP('GLUE CALCULATOR'!B293, 'obliczenia kleju'!$A$5:$B$1060, 2,FALSE)","v":"PRO"}]
[290,"WP002T",null,null,"Panel Lumio","Polyforce",1.1499999999999999,24.7,200,{"$f":"VLOOKUP('GLUE CALCULATOR'!B294, 'obliczenia kleju'!$A$5:$B$1060, 2,FALSE)","v":"PRO"}]
[291,"WP002RT",null,null,"Panel Lumio - pravý","Polyforce",1.1499999999999999,3.1,200,{"$f":"VLOOKUP('GLUE CALCULATOR'!B295, 'obliczenia kleju'!$A$5:$B$1060, 2,FALSE)","v":"PRO"}]
[292,"WP002LT",null,null,"Panel Lumio - levý","Polyforce",1.1499999999999999,3.1,200,{"$f":"VLOOKUP('GLUE CALCULATOR'!B296, 'obliczenia kleju'!$A$5:$B$1060, 2,FALSE)","v":"PRO"}]
[293,"WP003",null,null,"Panel Vivid","Polyforce",1.6,24.7,270,{"$f":"VLOOKUP('GLUE CALCULATOR'!B297, 'obliczenia kleju'!$A$5:$B$1060, 2,FALSE)","v":"PRO"}]
[294,"WP003R",null,null,"Panel Vivid - pravý","Polyforce",1.6,2.1,270,{"$f":"VLOOKUP('GLUE CALCULATOR'!B298, 'obliczenia kleju'!$A$5:$B$1060, 2,FALSE)","v":"PRO"}]
[295,"WP003L",null,null,"Panel Vivid - levý","Polyforce",1.6,2.1,270,{"$f":"VLOOKUP('GLUE CALCULATOR'!B299, 'obliczenia kleju'!$A$5:$B$1060, 2,FALSE)","v":"PRO"}]
[296,"WP003T",null,null,"Panel Vivid","Polyforce",1.6,24.7,200,{"$f":"VLOOKUP('GLUE CALCULATOR'!B300, 'obliczenia kleju'!$A$5:$B$1060, 2,FALSE)","v":"PRO"}]
[297,"WP003RT",null,null,"Panel Vivid - pravý","Polyforce",1.6,2.1,200,{"$f":"VLOOKUP('GLUE CALCULATOR'!B301, 'obliczenia kleju'!$A$5:$B$1060, 2,FALSE)","v":"PRO"}]
[298,"WP003LT",null,null,"Panel Vivid - levý","Polyforce",1.6,2.1,200,{"$f":"VLOOKUP('GLUE CALCULATOR'!B302, 'obliczenia kleju'!$A$5:$B$1060, 2,FALSE)","v":"PRO"}]
[299,"WP004",null,null,"Panel Eterno","Polyforce",2.1,25,270,{"$f":"VLOOKUP('GLUE CALCULATOR'!B303, 'obliczenia kleju'!$A$5:$B$1060, 2,FALSE)","v":"PRO"}]
[300,"WP004R",null,null,"Panel Eterno - pravý","Polyforce",2.1659999999999999,2.2000000000000002,270,{"$f":"VLOOKUP('GLUE CALCULATOR'!B304, 'obliczenia kleju'!$A$5:$B$1060, 2,FALSE)","v":"PRO"}]
[301,"WP004L",null,null,"Panel Eterno - levý","Polyforce",2.1659999999999999,2.5,270,{"$f":"VLOOKUP('GLUE CALCULATOR'!B305, 'obliczenia kleju'!$A$5:$B$1060, 2,FALSE)","v":"PRO"}]
[302,"WP004T",null,null,"Panel Eterno","Polyforce",2.1,25,200,{"$f":"VLOOKUP('GLUE CALCULATOR'!B306, 'obliczenia kleju'!$A$5:$B$1060, 2,FALSE)","v":"PRO"}]
[303,"WP004RT",null,null,"Panel Eterno - pravý","Polyforce",2.1659999999999999,2.2000000000000002,200,{"$f":"VLOOKUP('GLUE CALCULATOR'!B307, 'obliczenia kleju'!$A$5:$B$1060, 2,FALSE)","v":"PRO"}]
[304,"WP004LT",null,null,"Panel Eterno - levý","Polyforce",2.1659999999999999,2.5,200,{"$f":"VLOOKUP('GLUE CALCULATOR'!B308, 'obliczenia kleju'!$A$5:$B$1060, 2,FALSE)","v":"PRO"}]
[305,"WP005",null,null,"Panel Aria","Polyforce",1.85,25,270,{"$f":"VLOOKUP('GLUE CALCULATOR'!B309, 'obliczenia kleju'!$A$5:$B$1060, 2,FALSE)","v":"PRO"}]
[306,"WP005R",null,null,"Panel Aria - pravý","Polyforce",1.64,3.14,270,{"$f":"VLOOKUP('GLUE CALCULATOR'!B310, 'obliczenia kleju'!$A$5:$B$1060, 2,FALSE)","v":"PRO"}]
[307,"WP005L",null,null,"Panel Aria - levý","Polyforce",1.5,3.7,270,{"$f":"VLOOKUP('GLUE CALCULATOR'!B311, 'obliczenia kleju'!$A$5:$B$1060, 2,FALSE)","v":"PRO"}]
[308,"WP005T",null,null,"Panel Aria","Polyforce",1.85,25,200,{"$f":"VLOOKUP('GLUE CALCULATOR'!B312, 'obliczenia kleju'!$A$5:$B$1060, 2,FALSE)","v":"PRO"}]
[309,"WP005RT",null,null,"Panel Aria - pravý","Polyforce",1.64,3.14,200,{"$f":"VLOOKUP('GLUE CALCULATOR'!B313, 'obliczenia kleju'!$A$5:$B$1060, 2,FALSE)","v":"PRO"}]
[310,"WP005LT",null,null,"Panel Aria - levý","Polyforce",1.5,3.7,200,{"$f":"VLOOKUP('GLUE CALCULATOR'!B314, 'obliczenia kleju'!$A$5:$B$1060, 2,FALSE)","v":"PRO"}]
[311,"WP001P",null,null,"Panel Duna premium","Polyforce",1.32,24.7,270,{"$f":"VLOOKUP('GLUE CALCULATOR'!B315, 'obliczenia kleju'!$A$5:$B$1060, 2,FALSE)","v":"PRO"}]
[312,"WP001RP",null,null,"Panel Duna premium - pravý","Polyforce",1.32,3.1,270,{"$f":"VLOOKUP('GLUE CALCULATOR'!B316, 'obliczenia kleju'!$A$5:$B$1060, 2,FALSE)","v":"PRO"}]
[313,"WP001LP",null,null,"Panel Duna premium - levý","Polyforce",1.32,3.1,270,{"$f":"VLOOKUP('GLUE CALCULATOR'!B317, 'obliczenia kleju'!$A$5:$B$1060, 2,FALSE)","v":"PRO"}]
[314,"WP002P",null,null,"Panel Lumio premium","Polyforce",1.1499999999999999,24.7,270,{"$f":"VLOOKUP('GLUE CALCULATOR'!B318, 'obliczenia kleju'!$A$5:$B$1060, 2,FALSE)","v":"PRO"}]
[315,"WP002RP",null,null,"Panel Lumio premium - pravý","Polyforce",1.1499999999999999,3.1,270,{"$f":"VLOOKUP('GLUE CALCULATOR'!B319, 'obliczenia kleju'!$A$5:$B$1060, 2,FALSE)","v":"PRO"}]
[316,"WP002LP",null,null,"Panel Lumio premium - levý","Polyforce",1.1499999999999999,3.1,270,{"$f":"VLOOKUP('GLUE CALCULATOR'!B320, 'obliczenia kleju'!$A$5:$B$1060, 2,FALSE)","v":"PRO"}]
[317,"WP003P",null,null,"Panel Vivid premium","Polyforce",1.6,24.7,270,{"$f":"VLOOKUP('GLUE CALCULATOR'!B321, 'obliczenia kleju'!$A$5:$B$1060, 2,FALSE)","v":"PRO"}]
[318,"WP003RP",null,null,"Panel Vivid premium - pravý","Polyforce",1.6,2.1,270,{"$f":"VLOOKUP('GLUE CALCULATOR'!B322, 'obliczenia kleju'!$A$5:$B$1060, 2,FALSE)","v":"PRO"}]
[319,"WP003LP",null,null,"Panel Vivid premium - levý","Polyforce",1.6,2.1,270,{"$f":"VLOOKUP('GLUE CALCULATOR'!B323, 'obliczenia kleju'!$A$5:$B$1060, 2,FALSE)","v":"PRO"}]
[320,"WP004P",null,null,"Panel Eterno premium","Polyforce",2.1,25,270,{"$f":"VLOOKUP('GLUE CALCULATOR'!B324, 'obliczenia kleju'!$A$5:$B$1060, 2,FALSE)","v":"PRO"}]
[321,"WP004RP",null,null,"Panel Eterno premium - pravý","Polyforce",2.1659999999999999,2.2000000000000002,270,{"$f":"VLOOKUP('GLUE CALCULATOR'!B325, 'obliczenia kleju'!$A$5:$B$1060, 2,FALSE)","v":"PRO"}]
[322,"WP004LP",null,null,"Panel Eterno premium - levý","Polyforce",2.1659999999999999,2.5,270,{"$f":"VLOOKUP('GLUE CALCULATOR'!B326, 'obliczenia kleju'!$A$5:$B$1060, 2,FALSE)","v":"PRO"}]
[323,"WP005P",null,null,"Panel premium Aria","Polyforce",1.85,25,270,{"$f":"VLOOKUP('GLUE CALCULATOR'!B327, 'obliczenia kleju'!$A$5:$B$1060, 2,FALSE)","v":"PRO"}]
[324,"WP005RP",null,null,"Panel Aria premium - pravý","Polyforce",1.64,3.14,270,{"$f":"VLOOKUP('GLUE CALCULATOR'!B328, 'obliczenia kleju'!$A$5:$B$1060, 2,FALSE)","v":"PRO"}]
[325,"WP005LP",null,null,"Panel Aria premium - levý","Polyforce",1.5,3.7,270,{"$f":"VLOOKUP('GLUE CALCULATOR'!B329, 'obliczenia kleju'!$A$5:$B$1060, 2,FALSE)","v":"PRO"}]
[326,"WP001TP",null,null,"Panel Duna premium","Polyforce",1.32,24.7,200,{"$f":"VLOOKUP('GLUE CALCULATOR'!B330, 'obliczenia kleju'!$A$5:$B$1060, 2,FALSE)","v":"PRO"}]
[327,"WP001RTP",null,null,"Panel Duna premium - levý","Polyforce",1.32,3.1,200,{"$f":"VLOOKUP('GLUE CALCULATOR'!B331, 'obliczenia kleju'!$A$5:$B$1060, 2,FALSE)","v":"PRO"}]
[328,"WP001LTP",null,null,"Panel Duna premium- levý","Polyforce",1.32,3.1,200,{"$f":"VLOOKUP('GLUE CALCULATOR'!B332, 'obliczenia kleju'!$A$5:$B$1060, 2,FALSE)","v":"PRO"}]
[329,"WP002TP",null,null,"Panel Lumio premium","Polyforce",1.1499999999999999,24.7,200,{"$f":"VLOOKUP('GLUE CALCULATOR'!B333, 'obliczenia kleju'!$A$5:$B$1060, 2,FALSE)","v":"PRO"}]
[330,"WP002RTP",null,null,"Panel Lumio premium - levý","Polyforce",1.1499999999999999,3.1,200,{"$f":"VLOOKUP('GLUE CALCULATOR'!B334, 'obliczenia kleju'!$A$5:$B$1060, 2,FALSE)","v":"PRO"}]
[331,"WP002LTP",null,null,"Panel Lumio premium - pravý","Polyforce",1.1499999999999999,3.1,200,{"$f":"VLOOKUP('GLUE CALCULATOR'!B335, 'obliczenia kleju'!$A$5:$B$1060, 2,FALSE)","v":"PRO"}]
[332,"WP003TP",null,null,"Panel Vivid premium","Polyforce",1.6,24.7,200,{"$f":"VLOOKUP('GLUE CALCULATOR'!B336, 'obliczenia kleju'!$A$5:$B$1060, 2,FALSE)","v":"PRO"}]
[333,"WP003RTP",null,null,"Panel Vivid premium - pravý","Polyforce",1.6,2.1,200,{"$f":"VLOOKUP('GLUE CALCULATOR'!B337, 'obliczenia kleju'!$A$5:$B$1060, 2,FALSE)","v":"PRO"}]
[334,"WP003LTP",null,null,"Panel Vivid premium - levý","Polyforce",1.6,2.1,200,{"$f":"VLOOKUP('GLUE CALCULATOR'!B338, 'obliczenia kleju'!$A$5:$B$1060, 2,FALSE)","v":"PRO"}]
[335,"WP003A",null,null,"Dekorace k panelu Vivid premium","Polyforce",2.5,4.5,270,{"$f":"VLOOKUP('GLUE CALCULATOR'!B339, 'obliczenia kleju'!$A$5:$B$1060, 2,FALSE)","v":"PRO"}]
[336,"WP003AP",null,null,"Dekorace k panelu Vivid premium","Polyforce",2.5,4.5,270,{"$f":"VLOOKUP('GLUE CALCULATOR'!B340, 'obliczenia kleju'!$A$5:$B$1060, 2,FALSE)","v":"PRO"}]
[337,"WP003AT",null,null,"Dekorace k panelu Vivid premium","Polyforce",2.5,4.5,200,{"$f":"VLOOKUP('GLUE CALCULATOR'!B341, 'obliczenia kleju'!$A$5:$B$1060, 2,FALSE)","v":"PRO"}]
[338,"WP003ATP",null,null,"Dekorace k panelu Vivid premium","Polyforce",2.5,4.5,200,{"$f":"VLOOKUP('GLUE CALCULATOR'!B342, 'obliczenia kleju'!$A$5:$B$1060, 2,FALSE)","v":"PRO"}]
[339,"WP004TP",null,null,"Panel Eterno premium","Polyforce",2.1,25,200,{"$f":"VLOOKUP('GLUE CALCULATOR'!B343, 'obliczenia kleju'!$A$5:$B$1060, 2,FALSE)","v":"PRO"}]
[340,"WP004RTP",null,null,"Panel Eterno premium - pravý","Polyforce",2.1659999999999999,2.2000000000000002,200,{"$f":"VLOOKUP('GLUE CALCULATOR'!B344, 'obliczenia kleju'!$A$5:$B$1060, 2,FALSE)","v":"PRO"}]
[341,"WP004LTP",null,null,"Panel Eterno premium - levý","Polyforce",2.1659999999999999,2.5,200,{"$f":"VLOOKUP('GLUE CALCULATOR'!B345, 'obliczenia kleju'!$A$5:$B$1060, 2,FALSE)","v":"PRO"}]
[342,"WP005TP",null,null,"Panel Aria premium","Polyforce",1.85,25,200,{"$f":"VLOOKUP('GLUE CALCULATOR'!B346, 'obliczenia kleju'!$A$5:$B$1060, 2,FALSE)","v":"PRO"}]
[343,"WP005RTP",null,null,"Panel Aria premium - pravý","Polyforce",1.64,3.14,200,{"$f":"VLOOKUP('GLUE CALCULATOR'!B347, 'obliczenia kleju'!$A$5:$B$1060, 2,FALSE)","v":"PRO"}]
[344,"WP005LTP",null,null,"Panel Aria premium - levý","Polyforce",1.5,3.7,200,{"$f":"VLOOKUP('GLUE CALCULATOR'!B348, 'obliczenia kleju'!$A$5:$B$1060, 2,FALSE)","v":"PRO"}]
[345,"L0101",null,null,"Paenl Stretto","Polyforce",1.2,12,270,{"$f":"VLOOKUP('GLUE CALCULATOR'!B349, 'obliczenia kleju'!$A$5:$B$1060, 2,FALSE)","v":"PRO"}]
[346,"L0101L",null,null,"Panel Stretto - levý","Polyforce",1.2,3.6,270,{"$f":"VLOOKUP('GLUE CALCULATOR'!B350, 'obliczenia kleju'!$A$5:$B$1060, 2,FALSE)","v":"PRO"}]
[347,"L0101R",null,null,"Panel Stretto - pravý","Polyforce",1.2,2.2999999999999998,270,{"$f":"VLOOKUP('GLUE CALCULATOR'!B351, 'obliczenia kleju'!$A$5:$B$1060, 2,FALSE)","v":"PRO"}]
[348,"L0102",null,null,"Paenl Stretto","Polyforce",1.2,12,270,{"$f":"VLOOKUP('GLUE CALCULATOR'!B352, 'obliczenia kleju'!$A$5:$B$1060, 2,FALSE)","v":"PRO"}]
[349,"L0102L",null,null,"Panel Stretto - levý","Polyforce",1.2,3.6,270,{"$f":"VLOOKUP('GLUE CALCULATOR'!B353, 'obliczenia kleju'!$A$5:$B$1060, 2,FALSE)","v":"PRO"}]
[350,"L0102R",null,null,"Panel Stretto - pravý","Polyforce",1.2,2.2999999999999998,270,{"$f":"VLOOKUP('GLUE CALCULATOR'!B354, 'obliczenia kleju'!$A$5:$B$1060, 2,FALSE)","v":"PRO"}]
[351,"L0103",null,null,"Paenl Stretto","Polyforce",1.2,12,270,{"$f":"VLOOKUP('GLUE CALCULATOR'!B355, 'obliczenia kleju'!$A$5:$B$1060, 2,FALSE)","v":"PRO"}]
[352,"L0103L",null,null,"Panel Stretto - levý","Polyforce",1.2,3.6,270,{"$f":"VLOOKUP('GLUE CALCULATOR'!B356, 'obliczenia kleju'!$A$5:$B$1060, 2,FALSE)","v":"PRO"}]
[353,"L0103R",null,null,"Panel Stretto - pravý","Polyforce",1.2,2.2999999999999998,270,{"$f":"VLOOKUP('GLUE CALCULATOR'!B357, 'obliczenia kleju'!$A$5:$B$1060, 2,FALSE)","v":"PRO"}]
[354,"L0104",null,null,"Paenl Stretto","Polyforce",1.2,12,270,{"$f":"VLOOKUP('GLUE CALCULATOR'!B358, 'obliczenia kleju'!$A$5:$B$1060, 2,FALSE)","v":"PRO"}]
[355,"L0104L",null,null,"Panel Stretto - levý","Polyforce",1.2,3.6,270,{"$f":"VLOOKUP('GLUE CALCULATOR'!B359, 'obliczenia kleju'!$A$5:$B$1060, 2,FALSE)","v":"PRO"}]
[356,"L0104R",null,null,"Panel Stretto - pravý","Polyforce",1.2,2.2999999999999998,270,{"$f":"VLOOKUP('GLUE CALCULATOR'!B360, 'obliczenia kleju'!$A$5:$B$1060, 2,FALSE)","v":"PRO"}]
[357,"L0105",null,null,"Paenl Stretto","Polyforce",1.2,12,270,{"$f":"VLOOKUP('GLUE CALCULATOR'!B361, 'obliczenia kleju'!$A$5:$B$1060, 2,FALSE)","v":"PRO"}]
[358,"L0105L",null,null,"Panel Stretto - levý","Polyforce",1.2,3.6,270,{"$f":"VLOOKUP('GLUE CALCULATOR'!B362, 'obliczenia kleju'!$A$5:$B$1060, 2,FALSE)","v":"PRO"}]
[359,"L0105R",null,null,"Panel Stretto - pravý","Polyforce",1.2,2.2999999999999998,270,{"$f":"VLOOKUP('GLUE CALCULATOR'!B363, 'obliczenia kleju'!$A$5:$B$1060, 2,FALSE)","v":"PRO"}]
[360,"L0106",null,null,"Paenl Stretto","Polyforce",1.2,12,270,{"$f":"VLOOKUP('GLUE CALCULATOR'!B364, 'obliczenia kleju'!$A$5:$B$1060, 2,FALSE)","v":"PRO"}]
[361,"L0106L",null,null,"Panel Stretto - levý","Polyforce",1.2,3.6,270,{"$f":"VLOOKUP('GLUE CALCULATOR'!B365, 'obliczenia kleju'!$A$5:$B$1060, 2,FALSE)","v":"PRO"}]
[362,"L0106R",null,null,"Panel Stretto - pravý","Polyforce",1.2,2.2999999999999998,270,{"$f":"VLOOKUP('GLUE CALCULATOR'!B366, 'obliczenia kleju'!$A$5:$B$1060, 2,FALSE)","v":"PRO"}]
[363,"L0101T",null,null,"Paenl Stretto","Polyforce",1.2,12,200,{"$f":"VLOOKUP('GLUE CALCULATOR'!B367, 'obliczenia kleju'!$A$5:$B$1060, 2,FALSE)","v":"PRO"}]
[364,"L0101LT",null,null,"Panel Stretto - levý","Polyforce",1.2,3.6,200,{"$f":"VLOOKUP('GLUE CALCULATOR'!B368, 'obliczenia kleju'!$A$5:$B$1060, 2,FALSE)","v":"PRO"}]
[365,"L0101RT",null,null,"Panel Stretto - pravý","Polyforce",1.2,2.2999999999999998,200,{"$f":"VLOOKUP('GLUE CALCULATOR'!B369, 'obliczenia kleju'!$A$5:$B$1060, 2,FALSE)","v":"PRO"}]
[366,"L0102T",null,null,"Paenl Stretto","Polyforce",1.2,12,200,{"$f":"VLOOKUP('GLUE CALCULATOR'!B370, 'obliczenia kleju'!$A$5:$B$1060, 2,FALSE)","v":"PRO"}]
[367,"L0102LT",null,null,"Panel Stretto - levý","Polyforce",1.2,3.6,200,{"$f":"VLOOKUP('GLUE CALCULATOR'!B371, 'obliczenia kleju'!$A$5:$B$1060, 2,FALSE)","v":"PRO"}]
[368,"L0102RT",null,null,"Panel Stretto - pravý","Polyforce",1.2,2.2999999999999998,200,{"$f":"VLOOKUP('GLUE CALCULATOR'!B372, 'obliczenia kleju'!$A$5:$B$1060, 2,FALSE)","v":"PRO"}]
[369,"L0103T",null,null,"Paenl Stretto","Polyforce",1.2,12,200,{"$f":"VLOOKUP('GLUE CALCULATOR'!B373, 'obliczenia kleju'!$A$5:$B$1060, 2,FALSE)","v":"PRO"}]
[370,"L0103LT",null,null,"Panel Stretto - levý","Polyforce",1.2,3.6,200,{"$f":"VLOOKUP('GLUE CALCULATOR'!B374, 'obliczenia kleju'!$A$5:$B$1060, 2,FALSE)","v":"PRO"}]
[371,"L0103RT",null,null,"Panel Stretto - pravý","Polyforce",1.2,2.2999999999999998,200,{"$f":"VLOOKUP('GLUE CALCULATOR'!B375, 'obliczenia kleju'!$A$5:$B$1060, 2,FALSE)","v":"PRO"}]
[372,"L0104T",null,null,"Paenl Stretto","Polyforce",1.2,12,200,{"$f":"VLOOKUP('GLUE CALCULATOR'!B376, 'obliczenia kleju'!$A$5:$B$1060, 2,FALSE)","v":"PRO"}]
[373,"L0104LT",null,null,"Panel Stretto - levý","Polyforce",1.2,3.6,200,{"$f":"VLOOKUP('GLUE CALCULATOR'!B377, 'obliczenia kleju'!$A$5:$B$1060, 2,FALSE)","v":"PRO"}]
[374,"L0104RT",null,null,"Panel Stretto - pravý","Polyforce",1.2,2.2999999999999998,200,{"$f":"VLOOKUP('GLUE CALCULATOR'!B378, 'obliczenia kleju'!$A$5:$B$1060, 2,FALSE)","v":"PRO"}]
[375,"L0105T",null,null,"Paenl Stretto","Polyforce",1.2,12,200,{"$f":"VLOOKUP('GLUE CALCULATOR'!B379, 'obliczenia kleju'!$A$5:$B$1060, 2,FALSE)","v":"PRO"}]
[376,"L0105LT",null,null,"Panel Stretto - levý","Polyforce",1.2,3.6,200,{"$f":"VLOOKUP('GLUE CALCULATOR'!B380, 'obliczenia kleju'!$A$5:$B$1060, 2,FALSE)","v":"PRO"}]
[377,"L0105RT",null,null,"Panel Stretto - pravý","Polyforce",1.2,2.2999999999999998,200,{"$f":"VLOOKUP('GLUE CALCULATOR'!B381, 'obliczenia kleju'!$A$5:$B$1060, 2,FALSE)","v":"PRO"}]
[378,"L0106T",null,null,"Paenl Stretto","Polyforce",1.2,12,200,{"$f":"VLOOKUP('GLUE CALCULATOR'!B382, 'obliczenia kleju'!$A$5:$B$1060, 2,FALSE)","v":"PRO"}]
[379,"L0106LT",null,null,"Panel Stretto - levý","Polyforce",1.2,3.6,200,{"$f":"VLOOKUP('GLUE CALCULATOR'!B383, 'obliczenia kleju'!$A$5:$B$1060, 2,FALSE)","v":"PRO"}]
[380,"L0106RT",null,null,"Panel Stretto - pravý","Polyforce",1.2,2.2999999999999998,200,{"$f":"VLOOKUP('GLUE CALCULATOR'!B384, 'obliczenia kleju'!$A$5:$B$1060, 2,FALSE)","v":"PRO"}]
[381,"L0201",null,null,"Panel Medio","Polyforce",1.2,12.1,270,{"$f":"VLOOKUP('GLUE CALCULATOR'!B385, 'obliczenia kleju'!$A$5:$B$1060, 2,FALSE)","v":"PRO"}]
[382,"L0201L",null,null,"Panel Medio - levý","Polyforce",1.2,2.8,270,{"$f":"VLOOKUP('GLUE CALCULATOR'!B386, 'obliczenia kleju'!$A$5:$B$1060, 2,FALSE)","v":"PRO"}]
[383,"L0201R",null,null,"Panel Medio - pravý","Polyforce",1.2,3.9,270,{"$f":"VLOOKUP('GLUE CALCULATOR'!B387, 'obliczenia kleju'!$A$5:$B$1060, 2,FALSE)","v":"PRO"}]
[384,"L0202",null,null,"Panel Medio","Polyforce",1.2,12.1,270,{"$f":"VLOOKUP('GLUE CALCULATOR'!B388, 'obliczenia kleju'!$A$5:$B$1060, 2,FALSE)","v":"PRO"}]
[385,"L0202L",null,null,"Panel Medio levý zakončovací profil","Polyforce",1.2,2.8,270,{"$f":"VLOOKUP('GLUE CALCULATOR'!B389, 'obliczenia kleju'!$A$5:$B$1060, 2,FALSE)","v":"PRO"}]
[386,"L0202R",null,null,"Paenl Medio pravý zakončovací profil","Polyforce",1.2,3.9,270,{"$f":"VLOOKUP('GLUE CALCULATOR'!B390, 'obliczenia kleju'!$A$5:$B$1060, 2,FALSE)","v":"PRO"}]
[387,"L0203",null,null,"Panel Medio","Polyforce",1.2,12.1,270,{"$f":"VLOOKUP('GLUE CALCULATOR'!B391, 'obliczenia kleju'!$A$5:$B$1060, 2,FALSE)","v":"PRO"}]
[388,"L0203L",null,null,"Panel Medio levý zakončovací profil","Polyforce",1.2,2.8,270,{"$f":"VLOOKUP('GLUE CALCULATOR'!B392, 'obliczenia kleju'!$A$5:$B$1060, 2,FALSE)","v":"PRO"}]
[389,"L0203R",null,null,"Paenl Medio pravý zakončovací profil","Polyforce",1.2,3.9,270,{"$f":"VLOOKUP('GLUE CALCULATOR'!B393, 'obliczenia kleju'!$A$5:$B$1060, 2,FALSE)","v":"PRO"}]
[390,"L0204",null,null,"Panel Medio","Polyforce",1.2,12.1,270,{"$f":"VLOOKUP('GLUE CALCULATOR'!B394, 'obliczenia kleju'!$A$5:$B$1060, 2,FALSE)","v":"PRO"}]
[391,"L0204L",null,null,"Panel Medio levý zakončovací profil","Polyforce",1.2,2.8,270,{"$f":"VLOOKUP('GLUE CALCULATOR'!B395, 'obliczenia kleju'!$A$5:$B$1060, 2,FALSE)","v":"PRO"}]
[392,"L0204R",null,null,"Paenl Medio pravý zakončovací profil","Polyforce",1.2,3.9,270,{"$f":"VLOOKUP('GLUE CALCULATOR'!B396, 'obliczenia kleju'!$A$5:$B$1060, 2,FALSE)","v":"PRO"}]
[393,"L0205",null,null,"Panel Medio","Polyforce",1.2,12.1,270,{"$f":"VLOOKUP('GLUE CALCULATOR'!B397, 'obliczenia kleju'!$A$5:$B$1060, 2,FALSE)","v":"PRO"}]
[394,"L0205L",null,null,"Panel Medio levý zakončovací profil","Polyforce",1.2,2.8,270,{"$f":"VLOOKUP('GLUE CALCULATOR'!B398, 'obliczenia kleju'!$A$5:$B$1060, 2,FALSE)","v":"PRO"}]
[395,"L0205R",null,null,"Paenl Medio pravý zakončovací profil","Polyforce",1.2,3.9,270,{"$f":"VLOOKUP('GLUE CALCULATOR'!B399, 'obliczenia kleju'!$A$5:$B$1060, 2,FALSE)","v":"PRO"}]
[396,"L0206",null,null,"Panel Medio","Polyforce",1.2,12.1,270,{"$f":"VLOOKUP('GLUE CALCULATOR'!B400, 'obliczenia kleju'!$A$5:$B$1060, 2,FALSE)","v":"PRO"}]
[397,"L0206L",null,null,"Panel Medio levý zakončovací profil","Polyforce",1.2,2.8,270,{"$f":"VLOOKUP('GLUE CALCULATOR'!B401, 'obliczenia kleju'!$A$5:$B$1060, 2,FALSE)","v":"PRO"}]
[398,"L0206R",null,null,"Paenl Medio pravý zakončovací profil","Polyforce",1.2,3.9,270,{"$f":"VLOOKUP('GLUE CALCULATOR'!B402, 'obliczenia kleju'!$A$5:$B$1060, 2,FALSE)","v":"PRO"}]
[399,"L0201T",null,null,"Panel Medio","Polyforce",1.2,12.1,200,{"$f":"VLOOKUP('GLUE CALCULATOR'!B403, 'obliczenia kleju'!$A$5:$B$1060, 2,FALSE)","v":"PRO"}]
[400,"L0201LT",null,null,"Panel Medio levý zakončovací profil","Polyforce",1.2,2.8,200,{"$f":"VLOOKUP('GLUE CALCULATOR'!B404, 'obliczenia kleju'!$A$5:$B$1060, 2,FALSE)","v":"PRO"}]
[401,"L0201RT",null,null,"Paenl Medio pravý zakončovací profil","Polyforce",1.2,3.9,200,{"$f":"VLOOKUP('GLUE CALCULATOR'!B405, 'obliczenia kleju'!$A$5:$B$1060, 2,FALSE)","v":"PRO"}]
[402,"L0202T",null,null,"Panel Medio","Polyforce",1.2,12.1,200,{"$f":"VLOOKUP('GLUE CALCULATOR'!B406, 'obliczenia kleju'!$A$5:$B$1060, 2,FALSE)","v":"PRO"}]
[403,"L0202LT",null,null,"Panel Medio levý zakončovací profil","Polyforce",1.2,2.8,200,{"$f":"VLOOKUP('GLUE CALCULATOR'!B407, 'obliczenia kleju'!$A$5:$B$1060, 2,FALSE)","v":"PRO"}]
[404,"L0202RT",null,null,"Paenl Medio pravý zakončovací profil","Polyforce",1.2,3.9,200,{"$f":"VLOOKUP('GLUE CALCULATOR'!B408, 'obliczenia kleju'!$A$5:$B$1060, 2,FALSE)","v":"PRO"}]
[405,"L0203T",null,null,"Panel Medio","Polyforce",1.2,12.1,200,{"$f":"VLOOKUP('GLUE CALCULATOR'!B409, 'obliczenia kleju'!$A$5:$B$1060, 2,FALSE)","v":"PRO"}]
[406,"L0203LT",null,null,"Panel Medio levý zakončovací profil","Polyforce",1.2,2.8,200,{"$f":"VLOOKUP('GLUE CALCULATOR'!B410, 'obliczenia kleju'!$A$5:$B$1060, 2,FALSE)","v":"PRO"}]
[407,"L0203RT",null,null,"Paenl Medio pravý zakončovací profil","Polyforce",1.2,3.9,200,{"$f":"VLOOKUP('GLUE CALCULATOR'!B411, 'obliczenia kleju'!$A$5:$B$1060, 2,FALSE)","v":"PRO"}]
[408,"L0204T",null,null,"Panel Medio","Polyforce",1.2,12.1,200,{"$f":"VLOOKUP('GLUE CALCULATOR'!B412, 'obliczenia kleju'!$A$5:$B$1060, 2,FALSE)","v":"PRO"}]
[409,"L0204LT",null,null,"Panel Medio levý zakončovací profil","Polyforce",1.2,2.8,200,{"$f":"VLOOKUP('GLUE CALCULATOR'!B413, 'obliczenia kleju'!$A$5:$B$1060, 2,FALSE)","v":"PRO"}]
[410,"L0204RT",null,null,"Paenl Medio pravý zakončovací profil","Polyforce",1.2,3.9,200,{"$f":"VLOOKUP('GLUE CALCULATOR'!B414, 'obliczenia kleju'!$A$5:$B$1060, 2,FALSE)","v":"PRO"}]
[411,"L0205T",null,null,"Panel Medio","Polyforce",1.2,12.1,200,{"$f":"VLOOKUP('GLUE CALCULATOR'!B415, 'obliczenia kleju'!$A$5:$B$1060, 2,FALSE)","v":"PRO"}]
[412,"L0205LT",null,null,"Panel Medio levý zakončovací profil","Polyforce",1.2,2.8,200,{"$f":"VLOOKUP('GLUE CALCULATOR'!B416, 'obliczenia kleju'!$A$5:$B$1060, 2,FALSE)","v":"PRO"}]
[413,"L0205RT",null,null,"Paenl Medio pravý zakončovací profil","Polyforce",1.2,3.9,200,{"$f":"VLOOKUP('GLUE CALCULATOR'!B417, 'obliczenia kleju'!$A$5:$B$1060, 2,FALSE)","v":"PRO"}]
[414,"L0206T",null,null,"Panel Medio","Polyforce",1.2,12.1,200,{"$f":"VLOOKUP('GLUE CALCULATOR'!B418, 'obliczenia kleju'!$A$5:$B$1060, 2,FALSE)","v":"PRO"}]
[415,"L0206LT",null,null,"Panel Medio levý zakončovací profil","Polyforce",1.2,2.8,200,{"$f":"VLOOKUP('GLUE CALCULATOR'!B419, 'obliczenia kleju'!$A$5:$B$1060, 2,FALSE)","v":"PRO"}]
[416,"L0206RT",null,null,"Paenl Medio pravý zakončovací profil","Polyforce",1.2,3.9,200,{"$f":"VLOOKUP('GLUE CALCULATOR'!B420, 'obliczenia kleju'!$A$5:$B$1060, 2,FALSE)","v":"PRO"}]
[417,"L0301",null,null,"Panel Largo","Polyforce",2,11.5,270,{"$f":"VLOOKUP('GLUE CALCULATOR'!B421, 'obliczenia kleju'!$A$5:$B$1060, 2,FALSE)","v":"PRO"}]
[418,"L0301L",null,null,"Panel Largo levý zakončovací profil","Polyforce",2,3.1,270,{"$f":"VLOOKUP('GLUE CALCULATOR'!B422, 'obliczenia kleju'!$A$5:$B$1060, 2,FALSE)","v":"PRO"}]
[419,"L0301R",null,null,"Panel Largo pravý zakončovací profil","Polyforce",2,5.6,270,{"$f":"VLOOKUP('GLUE CALCULATOR'!B423, 'obliczenia kleju'!$A$5:$B$1060, 2,FALSE)","v":"PRO"}]
[420,"L0302",null,null,"Panel Largo","Polyforce",2,11.5,270,{"$f":"VLOOKUP('GLUE CALCULATOR'!B424, 'obliczenia kleju'!$A$5:$B$1060, 2,FALSE)","v":"PRO"}]
[421,"L0302L",null,null,"Panel Largo levý zakončovací profil","Polyforce",2,3.1,270,{"$f":"VLOOKUP('GLUE CALCULATOR'!B425, 'obliczenia kleju'!$A$5:$B$1060, 2,FALSE)","v":"PRO"}]
[422,"L0302R",null,null,"Panel Largo pravý zakončovací profil","Polyforce",2,5.6,270,{"$f":"VLOOKUP('GLUE CALCULATOR'!B426, 'obliczenia kleju'!$A$5:$B$1060, 2,FALSE)","v":"PRO"}]
[423,"L0303",null,null,"Panel Largo","Polyforce",2,11.5,270,{"$f":"VLOOKUP('GLUE CALCULATOR'!B427, 'obliczenia kleju'!$A$5:$B$1060, 2,FALSE)","v":"PRO"}]
[424,"L0303L",null,null,"Panel Largo levý zakončovací profil","Polyforce",2,3.1,270,{"$f":"VLOOKUP('GLUE CALCULATOR'!B428, 'obliczenia kleju'!$A$5:$B$1060, 2,FALSE)","v":"PRO"}]
[425,"L0303R",null,null,"Panel Largo pravý zakončovací profil","Polyforce",2,5.6,270,{"$f":"VLOOKUP('GLUE CALCULATOR'!B429, 'obliczenia kleju'!$A$5:$B$1060, 2,FALSE)","v":"PRO"}]
[426,"L0304",null,null,"Panel Largo","Polyforce",2,11.5,270,{"$f":"VLOOKUP('GLUE CALCULATOR'!B430, 'obliczenia kleju'!$A$5:$B$1060, 2,FALSE)","v":"PRO"}]
[427,"L0304L",null,null,"Panel Largo levý zakončovací profil","Polyforce",2,3.1,270,{"$f":"VLOOKUP('GLUE CALCULATOR'!B431, 'obliczenia kleju'!$A$5:$B$1060, 2,FALSE)","v":"PRO"}]
[428,"L0304R",null,null,"Panel Largo pravý zakončovací profil","Polyforce",2,5.6,270,{"$f":"VLOOKUP('GLUE CALCULATOR'!B432, 'obliczenia kleju'!$A$5:$B$1060, 2,FALSE)","v":"PRO"}]
[429,"L0305",null,null,"Panel Largo","Polyforce",2,11.5,270,{"$f":"VLOOKUP('GLUE CALCULATOR'!B433, 'obliczenia kleju'!$A$5:$B$1060, 2,FALSE)","v":"PRO"}]
[430,"L0305L",null,null,"Panel Largo levý zakončovací profil","Polyforce",2,3.1,270,{"$f":"VLOOKUP('GLUE CALCULATOR'!B434, 'obliczenia kleju'!$A$5:$B$1060, 2,FALSE)","v":"PRO"}]
[431,"L0305R",null,null,"Panel Largo pravý zakončovací profil","Polyforce",2,5.6,270,{"$f":"VLOOKUP('GLUE CALCULATOR'!B435, 'obliczenia kleju'!$A$5:$B$1060, 2,FALSE)","v":"PRO"}]
[432,"L0306",null,null,"Panel Largo","Polyforce",2,11.5,270,{"$f":"VLOOKUP('GLUE CALCULATOR'!B436, 'obliczenia kleju'!$A$5:$B$1060, 2,FALSE)","v":"PRO"}]
[433,"L0306L",null,null,"Panel Largo levý zakončovací profil","Polyforce",2,3.1,270,{"$f":"VLOOKUP('GLUE CALCULATOR'!B437, 'obliczenia kleju'!$A$5:$B$1060, 2,FALSE)","v":"PRO"}]
[434,"L0306R",null,null,"Panel Largo pravý zakončovací profil","Polyforce",2,5.6,270,{"$f":"VLOOKUP('GLUE CALCULATOR'!B438, 'obliczenia kleju'!$A$5:$B$1060, 2,FALSE)","v":"PRO"}]
[435,"L0301T",null,null,"Panel Largo","Polyforce",2,11.5,200,{"$f":"VLOOKUP('GLUE CALCULATOR'!B439, 'obliczenia kleju'!$A$5:$B$1060, 2,FALSE)","v":"PRO"}]
[436,"L0301LT",null,null,"Panel Largo levý zakončovací profil","Polyforce",2,3.1,200,{"$f":"VLOOKUP('GLUE CALCULATOR'!B440, 'obliczenia kleju'!$A$5:$B$1060, 2,FALSE)","v":"PRO"}]
[437,"L0301RT",null,null,"Panel Largo pravý zakončovací profil","Polyforce",2,5.6,200,{"$f":"VLOOKUP('GLUE CALCULATOR'!B441, 'obliczenia kleju'!$A$5:$B$1060, 2,FALSE)","v":"PRO"}]
[438,"L0302T",null,null,"Panel Largo","Polyforce",2,11.5,200,{"$f":"VLOOKUP('GLUE CALCULATOR'!B442, 'obliczenia kleju'!$A$5:$B$1060, 2,FALSE)","v":"PRO"}]
[439,"L0302LT",null,null,"Panel Largo levý zakončovací profil","Polyforce",2,3.1,200,{"$f":"VLOOKUP('GLUE CALCULATOR'!B443, 'obliczenia kleju'!$A$5:$B$1060, 2,FALSE)","v":"PRO"}]
[440,"L0302RT",null,null,"Panel Largo pravý zakončovací profil","Polyforce",2,5.6,200,{"$f":"VLOOKUP('GLUE CALCULATOR'!B444, 'obliczenia kleju'!$A$5:$B$1060, 2,FALSE)","v":"PRO"}]
[441,"L0303T",null,null,"Panel Largo","Polyforce",2,11.5,200,{"$f":"VLOOKUP('GLUE CALCULATOR'!B445, 'obliczenia kleju'!$A$5:$B$1060, 2,FALSE)","v":"PRO"}]
[442,"L0303LT",null,null,"Panel Largo levý zakončovací profil","Polyforce",2,3.1,200,{"$f":"VLOOKUP('GLUE CALCULATOR'!B446, 'obliczenia kleju'!$A$5:$B$1060, 2,FALSE)","v":"PRO"}]
[443,"L0303RT",null,null,"Panel Largo pravý zakončovací profil","Polyforce",2,5.6,200,{"$f":"VLOOKUP('GLUE CALCULATOR'!B447, 'obliczenia kleju'!$A$5:$B$1060, 2,FALSE)","v":"PRO"}]
[444,"L0304T",null,null,"Panel Largo","Polyforce",2,11.5,200,{"$f":"VLOOKUP('GLUE CALCULATOR'!B448, 'obliczenia kleju'!$A$5:$B$1060, 2,FALSE)","v":"PRO"}]
[445,"L0304LT",null,null,"Panel Largo levý zakončovací profil","Polyforce",2,3.1,200,{"$f":"VLOOKUP('GLUE CALCULATOR'!B449, 'obliczenia kleju'!$A$5:$B$1060, 2,FALSE)","v":"PRO"}]
[446,"L0304RT",null,null,"Panel Largo pravý zakončovací profil","Polyforce",2,5.6,200,{"$f":"VLOOKUP('GLUE CALCULATOR'!B450, 'obliczenia kleju'!$A$5:$B$1060, 2,FALSE)","v":"PRO"}]
[447,"L0305T",null,null,"Panel Largo","Polyforce",2,11.5,200,{"$f":"VLOOKUP('GLUE CALCULATOR'!B451, 'obliczenia kleju'!$A$5:$B$1060, 2,FALSE)","v":"PRO"}]
[448,"L0305LT",null,null,"Panel Largo levý zakončovací profil","Polyforce",2,3.1,200,{"$f":"VLOOKUP('GLUE CALCULATOR'!B452, 'obliczenia kleju'!$A$5:$B$1060, 2,FALSE)","v":"PRO"}]
[449,"L0305RT",null,null,"Panel Largo pravý zakončovací profil","Polyforce",2,5.6,200,{"$f":"VLOOKUP('GLUE CALCULATOR'!B453, 'obliczenia kleju'!$A$5:$B$1060, 2,FALSE)","v":"PRO"}]
[450,"L0306T",null,null,"Panel Largo","Polyforce",2,11.5,200,{"$f":"VLOOKUP('GLUE CALCULATOR'!B454, 'obliczenia kleju'!$A$5:$B$1060, 2,FALSE)","v":"PRO"}]
[451,"L0306LT",null,null,"Panel Largo levý zakončovací profil","Polyforce",2,3.1,200,{"$f":"VLOOKUP('GLUE CALCULATOR'!B455, 'obliczenia kleju'!$A$5:$B$1060, 2,FALSE)","v":"PRO"}]
[452,"L0306RT",null,null,"Panel Largo pravý zakončovací profil","Polyforce",2,5.6,200,{"$f":"VLOOKUP('GLUE CALCULATOR'!B456, 'obliczenia kleju'!$A$5:$B$1060, 2,FALSE)","v":"PRO"}]
[453,"L0401",null,null,"Panel Sereno","Polyforce",1.25,12,270,{"$f":"VLOOKUP('GLUE CALCULATOR'!B457, 'obliczenia kleju'!$A$5:$B$1060, 2,FALSE)","v":"PRO"}]
[454,"L0401L",null,null,"Panel Sereno levý zakončovací profil","Polyforce",1.25,4,270,{"$f":"VLOOKUP('GLUE CALCULATOR'!B458, 'obliczenia kleju'!$A$5:$B$1060, 2,FALSE)","v":"PRO"}]
[455,"L0401R",null,null,"Panel Sereno pravý zakončovací profil","Polyforce",1.25,4,270,{"$f":"VLOOKUP('GLUE CALCULATOR'!B459, 'obliczenia kleju'!$A$5:$B$1060, 2,FALSE)","v":"PRO"}]
[456,"L0401T",null,null,"Panel Sereno","Polyforce",1.25,12,200,{"$f":"VLOOKUP('GLUE CALCULATOR'!B460, 'obliczenia kleju'!$A$5:$B$1060, 2,FALSE)","v":"PRO"}]
[457,"L0401LT",null,null,"Panel Sereno levý zakončovací profil","Polyforce",1.25,4,200,{"$f":"VLOOKUP('GLUE CALCULATOR'!B461, 'obliczenia kleju'!$A$5:$B$1060, 2,FALSE)","v":"PRO"}]
[458,"L0401RT",null,null,"Panel Sereno pravý zakončovací profil","Polyforce",1.25,4,200,{"$f":"VLOOKUP('GLUE CALCULATOR'!B462, 'obliczenia kleju'!$A$5:$B$1060, 2,FALSE)","v":"PRO"}]
[459,"L0101P",null,null,"Panel Sereno","Polyforce",1.2,12,270,{"$f":"VLOOKUP('GLUE CALCULATOR'!B463, 'obliczenia kleju'!$A$5:$B$1060, 2,FALSE)","v":"PRO"}]
[460,"L0101LP",null,null,"Panel Sereno levý zakončovací profil","Polyforce",1.2,3.6,270,{"$f":"VLOOKUP('GLUE CALCULATOR'!B464, 'obliczenia kleju'!$A$5:$B$1060, 2,FALSE)","v":"PRO"}]
[461,"L0101RP",null,null,"Panel Sereno pravý zakončovací profil","Polyforce",1.2,2.2999999999999998,270,{"$f":"VLOOKUP('GLUE CALCULATOR'!B465, 'obliczenia kleju'!$A$5:$B$1060, 2,FALSE)","v":"PRO"}]
[462,"L0101TP",null,null,"Panel Sereno","Polyforce",1.2,12,200,{"$f":"VLOOKUP('GLUE CALCULATOR'!B466, 'obliczenia kleju'!$A$5:$B$1060, 2,FALSE)","v":"PRO"}]
[463,"L0101LTP",null,null,"Panel Sereno levý zakončovací profil","Polyforce",1.2,3.6,200,{"$f":"VLOOKUP('GLUE CALCULATOR'!B467, 'obliczenia kleju'!$A$5:$B$1060, 2,FALSE)","v":"PRO"}]
[464,"L0101RTP",null,null,"Panel Sereno pravý zakončovací profil","Polyforce",1.2,2.2999999999999998,200,{"$f":"VLOOKUP('GLUE CALCULATOR'!B468, 'obliczenia kleju'!$A$5:$B$1060, 2,FALSE)","v":"PRO"}]
[465,"L0201P",null,null,"Panel Medio premium","Polyforce",1.2,12.1,270,{"$f":"VLOOKUP('GLUE CALCULATOR'!B469, 'obliczenia kleju'!$A$5:$B$1060, 2,FALSE)","v":"PRO"}]
[466,"L0201LP",null,null,"Panel Medio premium levý zakončovací profil","Polyforce",1.2,2.8,270,{"$f":"VLOOKUP('GLUE CALCULATOR'!B470, 'obliczenia kleju'!$A$5:$B$1060, 2,FALSE)","v":"PRO"}]
[467,"L0201RP",null,null,"Panel Medio premium pravý zakončovací profil","Polyforce",1.2,3.9,270,{"$f":"VLOOKUP('GLUE CALCULATOR'!B471, 'obliczenia kleju'!$A$5:$B$1060, 2,FALSE)","v":"PRO"}]
[468,"L0201TP",null,null,"Panel Medio premium","Polyforce",1.2,12.1,200,{"$f":"VLOOKUP('GLUE CALCULATOR'!B472, 'obliczenia kleju'!$A$5:$B$1060, 2,FALSE)","v":"PRO"}]
[469,"L0201LTP",null,null,"Panel Medio premium levý zakončovací profil","Polyforce",1.2,2.8,200,{"$f":"VLOOKUP('GLUE CALCULATOR'!B473, 'obliczenia kleju'!$A$5:$B$1060, 2,FALSE)","v":"PRO"}]
[470,"L0201RTP",null,null,"Panel Medio premium pravý zakončovací profil","Polyforce",1.2,3.9,200,{"$f":"VLOOKUP('GLUE CALCULATOR'!B474, 'obliczenia kleju'!$A$5:$B$1060, 2,FALSE)","v":"PRO"}]
[471,"L0301P",null,null,"Paenl Largo premium","Polyforce",2,11.5,270,{"$f":"VLOOKUP('GLUE CALCULATOR'!B475, 'obliczenia kleju'!$A$5:$B$1060, 2,FALSE)","v":"PRO"}]
[472,"L0301LP",null,null,"Panel Largo premium levý zkončovací profil","Polyforce",2,3.1,270,{"$f":"VLOOKUP('GLUE CALCULATOR'!B476, 'obliczenia kleju'!$A$5:$B$1060, 2,FALSE)","v":"PRO"}]
[473,"L0301RP",null,null,"Panel Largo premium pravý zakončovací profil","Polyforce",2,5.6,270,{"$f":"VLOOKUP('GLUE CALCULATOR'!B477, 'obliczenia kleju'!$A$5:$B$1060, 2,FALSE)","v":"PRO"}]
[474,"L0301TP",null,null,"Paenl Largo premium","Polyforce",2,11.5,200,{"$f":"VLOOKUP('GLUE CALCULATOR'!B478, 'obliczenia kleju'!$A$5:$B$1060, 2,FALSE)","v":"PRO"}]
[475,"L0301LTP",null,null,"Panel Largo premium levý zkončovací profil","Polyforce",2,3.1,200,{"$f":"VLOOKUP('GLUE CALCULATOR'!B479, 'obliczenia kleju'!$A$5:$B$1060, 2,FALSE)","v":"PRO"}]
[476,"L0301RTP",null,null,"Panel Largo premium pravý zakončovací profil","Polyforce",2,5.6,200,{"$f":"VLOOKUP('GLUE CALCULATOR'!B480, 'obliczenia kleju'!$A$5:$B$1060, 2,FALSE)","v":"PRO"}]
[477,"L0401P",null,null,"Panel Sereno premium","Polyforce",1.25,12,270,{"$f":"VLOOKUP('GLUE CALCULATOR'!B481, 'obliczenia kleju'!$A$5:$B$1060, 2,FALSE)","v":"PRO"}]
[478,"L0401LP",null,null,"Panel Sereno premium levý zakončovací profil","Polyforce",1.25,4,270,{"$f":"VLOOKUP('GLUE CALCULATOR'!B482, 'obliczenia kleju'!$A$5:$B$1060, 2,FALSE)","v":"PRO"}]
[479,"L0401RP",null,null,"Panel Sereno premium pravý zakončovací profil","Polyforce",1.25,4,270,{"$f":"VLOOKUP('GLUE CALCULATOR'!B483, 'obliczenia kleju'!$A$5:$B$1060, 2,FALSE)","v":"PRO"}]
[480,"L0401TP",null,null,"Panel Sereno premium","Polyforce",1.25,12,200,{"$f":"VLOOKUP('GLUE CALCULATOR'!B484, 'obliczenia kleju'!$A$5:$B$1060, 2,FALSE)","v":"PRO"}]
[481,"L0401LTP",null,null,"Panel Sereno premium levý zakončovací profil","Polyforce",1.25,4,200,{"$f":"VLOOKUP('GLUE CALCULATOR'!B485, 'obliczenia kleju'!$A$5:$B$1060, 2,FALSE)","v":"PRO"}]
[482,"L0401RTP",null,null,"Panel Sereno premium pravý zakončovací profil","Polyforce",1.25,4,200,{"$f":"VLOOKUP('GLUE CALCULATOR'!B486, 'obliczenia kleju'!$A$5:$B$1060, 2,FALSE)","v":"PRO"}]

{"sheet":"obliczenia kleju","index":1,"n_rows":487,"n_cols":15,"rows_kept":487,"cut":false,"hidden":true,"merged":[]}
["0,0715 tubki na 1 m bieżący",null,null,null,null,null,null,7.1499999999999994E-2,null,null,null,"Fix Pro",null,"Fix Extra","MAX"]
["z 1 tubki kleju nałożymy 14mb paska kleju",null,null,null,null,null,null,null,null,null,null,{"$f":"ROUNDUP(L3,0)","v":0},null,{"$f":"ROUNDUP(N3,0)","v":0},{"$f":"ROUNDUP(O3,0)","v":0}]
[null,null,null,null,null,null,"Koeff. Punktowe naniesienie kleju",0.6,null,{"$f":"SUM(J6:J487)","v":0},{"$f":"SUM(K6:K487)","v":0},{"$f":"SUM(L6:L487)*H3","v":0},null,{"$f":"SUM(N6:N487)","v":0},{"$f":"SUM(O6:O487)*H3","v":0}]
[null,null,null,null,null,null,null,null,null," "]
["Towar","rodzaj kleju do montażu  ściany/sufitu","rodzaj kleju na łączenia","Materiał","Długość, m","Ilość linii nanoszenia kleju, szt","Odcinek boczny profila (cm)","Zamówiona ilość, szt","Długość montażu, m","Kleju dla montażu PRO","Kleju dla łączeń PRO","Łącznie kleju PRO","Długość łączeń EXTRA, m","Kleju dla łąćzeń EXTRA","Kleju dla montażu MAX"]
["MD001","PRO","EXTRA","Polyforce",2,2,3,{"$f":"VLOOKUP(A6, 'GLUE CALCULATOR'!$B$4:$C$1062, 2,FALSE)","v":0},{"$f":"H6*E6*F6","v":0},{"$f":"ROUND(I6*$H$1, 4)","v":0},null,{"$f":"J6","v":0},{"$f":"H6*(G6/100)","v":0},{"$f":"(M6+M6*50%)*$H$1","v":0}]
["MD002","PRO","EXTRA","Polyforce",2,2,4,{"$f":"VLOOKUP(A7, 'GLUE CALCULATOR'!$B$4:$C$1062, 2,FALSE)","v":0},{"$f":"H7*E7*F7","v":0},{"$f":"ROUND(I7*$H$1, 4)","v":0},null,0,0,0]
["MD003","PRO","EXTRA","Polyforce",2,1,2,{"$f":"VLOOKUP(A8, 'GLUE CALCULATOR'!$B$4:$C$1062, 2,FALSE)","v":0},0,0,null,0,0,0]
["MD004","PRO","EXTRA","Polyforce",2,2,7,{"$f":"VLOOKUP(A9, 'GLUE CALCULATOR'!$B$4:$C$1062, 2,FALSE)","v":0},0,0,null,0,0,0]
["MD005","PRO","EXTRA","Polyforce",2,3,16,{"$f":"VLOOKUP(A10, 'GLUE CALCULATOR'!$B$4:$C$1062, 2,FALSE)","v":0},0,0,null,0,0,0]
["MD006","PRO","EXTRA","Polyforce",2,3,16,{"$f":"VLOOKUP(A11, 'GLUE CALCULATOR'!$B$4:$C$1062, 2,FALSE)","v":0},0,0,null,0,0,0]
["MD007","PRO","EXTRA","Polyforce",2,2,7,{"$f":"VLOOKUP(A12, 'GLUE CALCULATOR'!$B$4:$C$1062, 2,FALSE)","v":0},0,0,null,0,0,0]
["MD008","PRO","EXTRA","Polyforce",2,2,9,{"$f":"VLOOKUP(A13, 'GLUE CALCULATOR'!$B$4:$C$1062, 2,FALSE)","v":0},0,0,null,0,0,0]
["MD009","PRO","EXTRA","Polyforce",2,2,10,{"$f":"VLOOKUP(A14, 'GLUE CALCULATOR'!$B$4:$C$1062, 2,FALSE)","v":0},0,0,null,0,0,0]
["MD010","PRO","EXTRA","Polyforce",2,1,1.5,{"$f":"VLOOKUP(A15, 'GLUE CALCULATOR'!$B$4:$C$1062, 2,FALSE)","v":0},0,0,null,0,0,0]
["MD011","PRO","EXTRA","Polyforce",2,2,4,{"$f":"VLOOKUP(A16, 'GLUE CALCULATOR'!$B$4:$C$1062, 2,FALSE)","v":0},0,0,null,0,0,0]
["MD012","PRO","EXTRA","Polyforce",2,1,2,{"$f":"VLOOKUP(A17, 'GLUE CALCULATOR'!$B$4:$C$1062, 2,FALSE)","v":0},0,0,null,0,0,0]
["MD013","PRO","EXTRA","Polyforce",2,2,10,{"$f":"VLOOKUP(A18, 'GLUE CALCULATOR'!$B$4:$C$1062, 2,FALSE)","v":0},{"$f":"H18*E18*F18","v":0},0,null,{"$f":"J18","v":0},0,0]
["MD014","PRO","EXTRA","Polyforce",2,3,8,{"$f":"VLOOKUP(A19, 'GLUE CALCULATOR'!$B$4:$C$1062, 2,FALSE)","v":0},0,0,null,0,0,0]
["MD016","PRO","EXTRA","Polyforce",2,2,10,{"$f":"VLOOKUP(A20, 'GLUE CALCULATOR'!$B$4:$C$1062, 2,FALSE)","v":0},0,0,null,0,0,0]
["MD017","PRO","EXTRA","Polyforce",2,2,7,{"$f":"VLOOKUP(A21, 'GLUE CALCULATOR'!$B$4:$C$1062, 2,FALSE)","v":0},0,0,null,0,0,0]
["MD018","PRO","EXTRA","Polyforce",2,2,12,{"$f":"VLOOKUP(A22, 'GLUE CALCULATOR'!$B$4:$C$1062, 2,FALSE)","v":0},0,0,null,0,0,0]
["MD020","PRO","EXTRA","Polyforce",2,4,40,{"$f":"VLOOKUP(A23, 'GLUE CALCULATOR'!$B$4:$C$1062, 2,FALSE)","v":0},0,0,null,0,0,0]
["MD024","PRO","EXTRA","Polyforce",2,2,16,{"$f":"VLOOKUP(A24, 'GLUE CALCULATOR'!$B$4:$C$1062, 2,FALSE)","v":0},0,0,null,0,0,0]
["MD025","PRO","EXTRA","Polyforce",2,3,22,{"$f":"VLOOKUP(A25, 'GLUE CALCULATOR'!$B$4:$C$1062, 2,FALSE)","v":0},0,0,null,0,0,0]
["MD026","PRO","EXTRA","Polyforce",2,2,4,{"$f":"VLOOKUP(A26, 'GLUE CALCULATOR'!$B$4:$C$1062, 2,FALSE)","v":0},0,0,null,0,0,0]
["MD027","PRO","EXTRA","Polyforce",2,2,6,{"$f":"VLOOKUP(A27, 'GLUE CALCULATOR'!$B$4:$C$1062, 2,FALSE)","v":0},0,0,null,0,0,0]
["MD028","PRO","EXTRA","Polyforce",2,2,6,{"$f":"VLOOKUP(A28, 'GLUE CALCULATOR'!$B$4:$C$1062, 2,FALSE)","v":0},0,0,null,0,0,0]
["MD030","PRO","EXTRA","Polyforce",2,2,8,{"$f":"VLOOKUP(A29, 'GLUE CALCULATOR'!$B$4:$C$1062, 2,FALSE)","v":0},0,0,null,0,0,0]
["MD031","PRO","EXTRA","Polyforce",2,2,3,{"$f":"VLOOKUP(A30, 'GLUE CALCULATOR'!$B$4:$C$1062, 2,FALSE)","v":0},0,0,null,0,0,0]
["MD032","PRO","EXTRA","Polyforce",2,2,6,{"$f":"VLOOKUP(A31, 'GLUE CALCULATOR'!$B$4:$C$1062, 2,FALSE)","v":0},0,0,null,0,0,0]
["MD057","PRO","EXTRA","Polyforce",2,2,11,{"$f":"VLOOKUP(A32, 'GLUE CALCULATOR'!$B$4:$C$1062, 2,FALSE)","v":0},{"$f":"H32*E32*F32","v":0},{"$f":"ROUND(I32*$H$1, 4)","v":0},null,{"$f":"J32","v":0},{"$f":"H32*(G32/100)","v":0},{"$f":"(M32+M32*50%)*$H$1","v":0}]
["MD070","PRO","EXTRA","Polyforce",2,2,11,{"$f":"VLOOKUP(A33, 'GLUE CALCULATOR'!$B$4:$C$1062, 2,FALSE)","v":0},0,0,null,0,0,0]
["MD094","PRO","EXTRA","Polyforce",2,2,9.5,{"$f":"VLOOKUP(A34, 'GLUE CALCULATOR'!$B$4:$C$1062, 2,FALSE)","v":0},0,0,null,0,0,0]
["MD095","PRO","EXTRA","Polyforce",2,3,18,{"$f":"VLOOKUP(A35, 'GLUE CALCULATOR'!$B$4:$C$1062, 2,FALSE)","v":0},0,0,null,0,0,0]
["MD105","MAX","EXTRA","Polyforce",2,4,35,{"$f":"VLOOKUP(A36, 'GLUE CALCULATOR'!$B$4:$C$1062, 2,FALSE)","v":0},0,null,null,null,0,0,{"$f":"ROUND(I36*$H$1, 4)","v":0}]
["MD105H","MAX","EXTRA","Polyforce",3,4,35,{"$f":"VLOOKUP(A37, 'GLUE CALCULATOR'!$B$4:$C$1062, 2,FALSE)","v":0},{"$f":"H37*E37*F37","v":0},null,null,null,{"$f":"H37*(G37/100)","v":0},{"$f":"(M37+M37*50%)*$H$1","v":0},{"$f":"ROUND(I37*$H$1, 4)","v":0}]
["MD106","PRO","EXTRA","Polyforce",2,2,10,{"$f":"VLOOKUP(A38, 'GLUE CALCULATOR'!$B$4:$C$1062, 2,FALSE)","v":0},0,0,null,0,0,0]
["MD110","MAX","EXTRA","Polyforce",2,2,13,{"$f":"VLOOKUP(A39, 'GLUE CALCULATOR'!$B$4:$C$1062, 2,FALSE)","v":0},0,null,null,null,0,0,{"$f":"ROUND(I39*$H$1, 4)","v":0}]
["MD111","MAX","EXTRA","Polyforce",2,2,11,{"$f":"VLOOKUP(A40, 'GLUE CALCULATOR'!$B$4:$C$1062, 2,FALSE)","v":0},0,null,null,null,0,0,{"$f":"ROUND(I40*$H$1, 4)","v":0}]
["MD118","PRO","EXTRA","Polyforce",2,1,9,{"$f":"VLOOKUP(A41, 'GLUE CALCULATOR'!$B$4:$C$1062, 2,FALSE)","v":0},0,0,null,0,0,0]
["MD137","MAX","EXTRA","Polyforce",2,3,11,{"$f":"VLOOKUP(A42, 'GLUE CALCULATOR'!$B$4:$C$1062, 2,FALSE)","v":0},0,null,null,null,0,0,{"$f":"ROUND(I42*$H$1, 4)","v":0}]
["MD145","PRO","EXTRA","Polyforce",2,2,14,{"$f":"VLOOKUP(A43, 'GLUE CALCULATOR'!$B$4:$C$1062, 2,FALSE)","v":0},0,0,null,0,0,0]
["MD156","MAX","EXTRA","Polyforce",2,4,40,{"$f":"VLOOKUP(A44, 'GLUE CALCULATOR'!$B$4:$C$1062, 2,FALSE)","v":0},0,null,null,null,0,0,{"$f":"ROUND(I44*$H$1, 4)","v":0}]
["MD161","MAX","EXTRA","Polyforce",2,3,28,{"$f":"VLOOKUP(A45, 'GLUE CALCULATOR'!$B$4:$C$1062, 2,FALSE)","v":0},0,null,null,null,0,0,{"$f":"ROUND(I45*$H$1, 4)","v":0}]
["MD172","PRO","EXTRA","Polyforce",2,2,8,{"$f":"VLOOKUP(A46, 'GLUE CALCULATOR'!$B$4:$C$1062, 2,FALSE)","v":0},0,0,null,0,0,0]
["MD210","PRO","EXTRA","Polyforce",2,2,8,{"$f":"VLOOKUP(A47, 'GLUE CALCULATOR'!$B$4:$C$1062, 2,FALSE)","v":0},0,0,null,0,0,0]
["MD213","MAX","EXTRA","Polyforce",2,2,18,{"$f":"VLOOKUP(A48, 'GLUE CALCULATOR'!$B$4:$C$1062, 2,FALSE)","v":0},0,null,null,null,0,0,{"$f":"ROUND(I48*$H$1, 4)","v":0}]
["MD234","PRO","EXTRA","Polyforce",2,2,10,{"$f":"VLOOKUP(A49, 'GLUE CALCULATOR'!$B$4:$C$1062, 2,FALSE)","v":0},0,0,null,0,0,0]
["MD235","PRO","EXTRA","Polyforce",2,2,2,{"$f":"VLOOKUP(A50, 'GLUE CALCULATOR'!$B$4:$C$1062, 2,FALSE)","v":0},0,0,null,0,0,0]
["MD236","PRO","EXTRA","Polyforce",2,2,15,{"$f":"VLOOKUP(A51, 'GLUE CALCULATOR'!$B$4:$C$1062, 2,FALSE)","v":0},0,0,null,0,0,0]
["MD237","PRO","EXTRA","Polyforce",2,2,6,{"$f":"VLOOKUP(A52, 'GLUE CALCULATOR'!$B$4:$C$1062, 2,FALSE)","v":0},0,0,null,0,0,0]
["MD255","PRO","EXTRA","Polyforce",2,2,4,{"$f":"VLOOKUP(A53, 'GLUE CALCULATOR'!$B$4:$C$1062, 2,FALSE)","v":0},0,0,null,0,0,0]
["MD258","PRO","EXTRA","Polyforce",2,2,12,{"$f":"VLOOKUP(A54, 'GLUE CALCULATOR'!$B$4:$C$1062, 2,FALSE)","v":0},0,0,null,0,0,0]
["MD308","PRO","EXTRA","Polyforce",2,2,10,{"$f":"VLOOKUP(A55, 'GLUE CALCULATOR'!$B$4:$C$1062, 2,FALSE)","v":0},0,0,null,0,0,0]
["MD314","PRO","EXTRA","Polyforce",2,2,8,{"$f":"VLOOKUP(A56, 'GLUE CALCULATOR'!$B$4:$C$1062, 2,FALSE)","v":0},0,0,null,0,0,0]
["MD317","PRO","EXTRA","Polyforce",2,2,5,{"$f":"VLOOKUP(A57, 'GLUE CALCULATOR'!$B$4:$C$1062, 2,FALSE)","v":0},0,0,null,0,0,0]
["MD318","PRO","EXTRA","Polyforce",2,2,5,{"$f":"VLOOKUP(A58, 'GLUE CALCULATOR'!$B$4:$C$1062, 2,FALSE)","v":0},0,0,null,0,0,0]
["MD325","PRO","EXTRA","Polyforce",2,2,6,{"$f":"VLOOKUP(A59, 'GLUE CALCULATOR'!$B$4:$C$1062, 2,FALSE)","v":0},0,0,null,0,0,0]
["MD332","PRO","EXTRA","Polyforce",2,2,4,{"$f":"VLOOKUP(A60, 'GLUE CALCULATOR'!$B$4:$C$1062, 2,FALSE)","v":0},{"$f":"H60*E60*F60","v":0},{"$f":"ROUND(I60*$H$1, 4)","v":0},null,0,0,0]
["MD338","PRO","EXTRA","Polyforce",2,2,10,{"$f":"VLOOKUP(A61, 'GLUE CALCULATOR'!$B$4:$C$1062, 2,FALSE)","v":0},0,0,null,0,0,0]
["MD346","PRO","EXTRA","Polyforce",2,2,9,{"$f":"VLOOKUP(A62, 'GLUE CALCULATOR'!$B$4:$C$1062, 2,FALSE)","v":0},0,0,null,0,0,0]
["MD354","PRO","EXTRA","Polyforce",2,2,14,{"$f":"VLOOKUP(A63, 'GLUE CALCULATOR'!$B$4:$C$1062, 2,FALSE)","v":0},0,0,null,0,0,0]
["MD355","PRO","EXTRA","Polyforce",2,3,18,{"$f":"VLOOKUP(A64, 'GLUE CALCULATOR'!$B$4:$C$1062, 2,FALSE)","v":0},0,0,null,0,0,0]
["MD356","PRO","EXTRA","Polyforce",2,3,20,{"$f":"VLOOKUP(A65, 'GLUE CALCULATOR'!$B$4:$C$1062, 2,FALSE)","v":0},0,0,null,0,0,0]
["MD358","PRO","EXTRA","Polyforce",2,3,20,{"$f":"VLOOKUP(A66, 'GLUE CALCULATOR'!$B$4:$C$1062, 2,FALSE)","v":0},0,0,null,0,0,0]
["MD359","PRO","EXTRA","Polyforce",2,2,13,{"$f":"VLOOKUP(A67, 'GLUE CALCULATOR'!$B$4:$C$1062, 2,FALSE)","v":0},0,0,null,0,0,0]
["MD359B","PRO","EXTRA","Polyforce",2,2,13,{"$f":"VLOOKUP(A68, 'GLUE CALCULATOR'!$B$4:$C$1062, 2,FALSE)","v":0},0,0,null,0,0,0]
["MD360","PRO","EXTRA","Polyforce",2,3,25,{"$f":"VLOOKUP(A69, 'GLUE CALCULATOR'!$B$4:$C$1062, 2,FALSE)","v":0},0,0,null,0,0,0]
["MD361","PRO","EXTRA","Polyforce",2,3,22,{"$f":"VLOOKUP(A70, 'GLUE CALCULATOR'!$B$4:$C$1062, 2,FALSE)","v":0},0,0,null,0,0,0]
["MD362","MAX","EXTRA","Polyforce",2,3,38,{"$f":"VLOOKUP(A71, 'GLUE CALCULATOR'!$B$4:$C$1062, 2,FALSE)","v":0},0,null,null,null,0,0,{"$f":"ROUND(I71*$H$1, 4)","v":0}]
["MD363","PRO","EXTRA","Polyforce",2,2,14,{"$f":"VLOOKUP(A72, 'GLUE CALCULATOR'!$B$4:$C$1062, 2,FALSE)","v":0},0,0,null,{"$f":"J72","v":0},{"$f":"H72*(G72/100)","v":0},{"$f":"(M72+M72*50%)*$H$1","v":0}]
["MD367","MAX","EXTRA","Polyforce",2,2,13,{"$f":"VLOOKUP(A73, 'GLUE CALCULATOR'!$B$4:$C$1062, 2,FALSE)","v":0},0,null,null,null,0,0,{"$f":"ROUND(I73*$H$1, 4)","v":0}]
["MD368","PRO","EXTRA","Polyforce",2,2,8,{"$f":"VLOOKUP(A74, 'GLUE CALCULATOR'!$B$4:$C$1062, 2,FALSE)","v":0},0,0,null,0,0,0]
["MD380","MAX","EXTRA","Polyforce",2,2,17,{"$f":"VLOOKUP(A75, 'GLUE CALCULATOR'!$B$4:$C$1062, 2,FALSE)","v":0},{"$f":"H75*E75*F75","v":0},null,null,null,0,0,{"$f":"ROUND(I75*$H$1, 4)","v":0}]
["MD413","PRO","EXTRA","Polyforce",2,1,3,{"$f":"VLOOKUP(A76, 'GLUE CALCULATOR'!$B$4:$C$1062, 2,FALSE)","v":0},0,{"$f":"ROUND(I76*$H$1, 4)","v":0},null,0,0,0]
["MD8300","PRO","EXTRA","Polyforce",2,2,12,{"$f":"VLOOKUP(A77, 'GLUE CALCULATOR'!$B$4:$C$1062, 2,FALSE)","v":0},0,0,null,0,0,0]
["MDA002","PRO","EXTRA","Profoam",2,2,15,{"$f":"VLOOKUP(A78, 'GLUE CALCULATOR'!$B$4:$C$1062, 2,FALSE)","v":0},0,0,null,0,0,0]
["MDA005","PRO","EXTRA","Profoam",2,2,11,{"$f":"VLOOKUP(A79, 'GLUE CALCULATOR'!$B$4:$C$1062, 2,FALSE)","v":0},0,0,null,0,0,0]
["MDA007","PRO","EXTRA","Profoam",2,2,20,{"$f":"VLOOKUP(A80, 'GLUE CALCULATOR'!$B$4:$C$1062, 2,FALSE)","v":0},0,0,null,0,0,0]
["MDA008","PRO","EXTRA","Profoam",2,2,12,{"$f":"VLOOKUP(A81, 'GLUE CALCULATOR'!$B$4:$C$1062, 2,FALSE)","v":0},0,0,null,0,0,0]
["MDA040","PRO","EXTRA","Profoam",2,3,23,{"$f":"VLOOKUP(A82, 'GLUE CALCULATOR'!$B$4:$C$1062, 2,FALSE)","v":0},0,0,null,0,0,0]
["MDA046","PRO","EXTRA","Profoam",2,3,22,{"$f":"VLOOKUP(A83, 'GLUE CALCULATOR'!$B$4:$C$1062, 2,FALSE)","v":0},0,0,null,0,0,0]
["MDA067","PRO","EXTRA","Profoam",2,3,23,{"$f":"VLOOKUP(A84, 'GLUE CALCULATOR'!$B$4:$C$1062, 2,FALSE)","v":0},0,0,null,0,0,0]
["MDA072","PRO","EXTRA","Profoam",2,3,22,{"$f":"VLOOKUP(A85, 'GLUE CALCULATOR'!$B$4:$C$1062, 2,FALSE)","v":0},0,0,null,0,0,0]
["MDA098","PRO","EXTRA","Profoam",2,2,17,{"$f":"VLOOKUP(A86, 'GLUE CALCULATOR'!$B$4:$C$1062, 2,FALSE)","v":0},0,0,null,0,0,0]
["MDA106","PRO","EXTRA","Profoam",2,2,13,{"$f":"VLOOKUP(A87, 'GLUE CALCULATOR'!$B$4:$C$1062, 2,FALSE)","v":0},0,0,null,0,0,0]
["MDA109","PRO","EXTRA","Profoam",2,4,50,{"$f":"VLOOKUP(A88, 'GLUE CALCULATOR'!$B$4:$C$1062, 2,FALSE)","v":0},0,0,null,0,0,0]
["MDA113","PRO","EXTRA","Profoam",2,4,50,{"$f":"VLOOKUP(A89, 'GLUE CALCULATOR'!$B$4:$C$1062, 2,FALSE)","v":0},0,0,null,0,0,0]
["MDA121","PRO","EXTRA","Profoam",2,2,13,{"$f":"VLOOKUP(A90, 'GLUE CALCULATOR'!$B$4:$C$1062, 2,FALSE)","v":0},0,0,null,0,0,0]
["MDA138","PRO","EXTRA","Profoam",2,4,30,{"$f":"VLOOKUP(A91, 'GLUE CALCULATOR'!$B$4:$C$1062, 2,FALSE)","v":0},0,0,null,0,0,0]
["MDA212","PRO","EXTRA","Profoam",2,2,12,{"$f":"VLOOKUP(A92, 'GLUE CALCULATOR'!$B$4:$C$1062, 2,FALSE)","v":0},0,0,null,0,0,0]
["MDA401","PRO","EXTRA","Profoam",2,3,26,{"$f":"VLOOKUP(A93, 'GLUE CALCULATOR'!$B$4:$C$1062, 2,FALSE)","v":0},0,0,null,0,0,0]
["MDB063","PRO","EXTRA","Profoam",2,2,9,{"$f":"VLOOKUP(A94, 'GLUE CALCULATOR'!$B$4:$C$1062, 2,FALSE)","v":0},0,0,null,0,0,0]
["MDB064","PRO","EXTRA","Profoam",2,2,13,{"$f":"VLOOKUP(A95, 'GLUE CALCULATOR'!$B$4:$C$1062, 2,FALSE)","v":0},0,0,null,0,0,0]
["MDB080","PRO","EXTRA","Profoam",2,2,12,{"$f":"VLOOKUP(A96, 'GLUE CALCULATOR'!$B$4:$C$1062, 2,FALSE)","v":0},{"$f":"H96*E96*F96","v":0},{"$f":"ROUND(I96*$H$1, 4)","v":0},null,{"$f":"J96","v":0},{"$f":"H96*(G96/100)","v":0},{"$f":"(M96+M96*50%)*$H$1","v":0}]
["MDB100","PRO","EXTRA","Profoam",2,3,16,{"$f":"VLOOKUP(A97, 'GLUE CALCULATOR'!$B$4:$C$1062, 2,FALSE)","v":0},0,0,null,0,0,0]
["MDB101","PRO","EXTRA","Profoam",2,3,23,{"$f":"VLOOKUP(A98, 'GLUE CALCULATOR'!$B$4:$C$1062, 2,FALSE)","v":0},0,0,null,0,0,0]
["MDB102","PRO","EXTRA","Profoam",2,2,13,{"$f":"VLOOKUP(A99, 'GLUE CALCULATOR'!$B$4:$C$1062, 2,FALSE)","v":0},0,0,null,0,0,0]
["MDB103","PRO","EXTRA","Profoam",2,4,35,{"$f":"VLOOKUP(A100, 'GLUE CALCULATOR'!$B$4:$C$1062, 2,FALSE)","v":0},0,0,null,0,0,0]
["MDB104","PRO","EXTRA","Profoam",2,4,29,{"$f":"VLOOKUP(A101, 'GLUE CALCULATOR'!$B$4:$C$1062, 2,FALSE)","v":0},0,0,null,0,0,0]
["MDB108","PRO","EXTRA","Profoam",2,2,20,{"$f":"VLOOKUP(A102, 'GLUE CALCULATOR'!$B$4:$C$1062, 2,FALSE)","v":0},0,0,null,0,0,0]
["MDB112","PRO","EXTRA","Profoam",2,2,10,{"$f":"VLOOKUP(A103, 'GLUE CALCULATOR'!$B$4:$C$1062, 2,FALSE)","v":0},0,0,null,0,0,0]
["MDB115","PRO","EXTRA","Profoam",2,2,18,{"$f":"VLOOKUP(A104, 'GLUE CALCULATOR'!$B$4:$C$1062, 2,FALSE)","v":0},0,0,null,0,0,0]
["MDB117","PRO","EXTRA","Profoam",2,2,16,{"$f":"VLOOKUP(A105, 'GLUE CALCULATOR'!$B$4:$C$1062, 2,FALSE)","v":0},0,0,null,0,0,0]
["MDB118","PRO","EXTRA","Profoam",2,2,17,{"$f":"VLOOKUP(A106, 'GLUE CALCULATOR'!$B$4:$C$1062, 2,FALSE)","v":0},0,0,null,0,0,0]
["MDB121","PRO","EXTRA","Profoam",2,4,38,{"$f":"VLOOKUP(A107, 'GLUE CALCULATOR'!$B$4:$C$1062, 2,FALSE)","v":0},0,0,null,0,0,0]
["MDB123","PRO","EXTRA","Profoam",2,2,9,{"$f":"VLOOKUP(A108, 'GLUE CALCULATOR'!$B$4:$C$1062, 2,FALSE)","v":0},0,0,null,0,0,0]
["MDB127","PRO","EXTRA","Profoam",2,2,20,{"$f":"VLOOKUP(A109, 'GLUE CALCULATOR'!$B$4:$C$1062, 2,FALSE)","v":0},0,0,null,0,0,0]
["MDB128","PRO","EXTRA","Profoam",2,4,38,{"$f":"VLOOKUP(A110, 'GLUE CALCULATOR'!$B$4:$C$1062, 2,FALSE)","v":0},0,0,null,0,0,0]
["MDB130","PRO","EXTRA","Profoam",2,3,36,{"$f":"VLOOKUP(A111, 'GLUE CALCULATOR'!$B$4:$C$1062, 2,FALSE)","v":0},0,0,null,0,0,0]
["MDB131","PRO","EXTRA","Profoam",2,3,27,{"$f":"VLOOKUP(A112, 'GLUE CALCULATOR'!$B$4:$C$1062, 2,FALSE)","v":0},0,0,null,0,0,0]
["MDB132","PRO","EXTRA","Profoam",2,3,18,{"$f":"VLOOKUP(A113, 'GLUE CALCULATOR'!$B$4:$C$1062, 2,FALSE)","v":0},0,0,null,0,0,0]
["MDB134","PRO","EXTRA","Profoam",2,3,20,{"$f":"VLOOKUP(A114, 'GLUE CALCULATOR'!$B$4:$C$1062, 2,FALSE)","v":0},0,0,null,0,0,0]
["MDB135","PRO","EXTRA","Profoam",2,2,5,{"$f":"VLOOKUP(A115, 'GLUE CALCULATOR'!$B$4:$C$1062, 2,FALSE)","v":0},0,0,null,0,0,0]
["MDB136","PRO","EXTRA","Profoam",2,2,7,{"$f":"VLOOKUP(A116, 'GLUE CALCULATOR'!$B$4:$C$1062, 2,FALSE)","v":0},0,0,null,0,0,0]
["MDB140","PRO","EXTRA","Profoam",2,3,30,{"$f":"VLOOKUP(A117, 'GLUE CALCULATOR'!$B$4:$C$1062, 2,FALSE)","v":0},0,0,null,0,0,0]
["MDB142","PRO","EXTRA","Profoam",2,2,17,{"$f":"VLOOKUP(A118, 'GLUE CALCULATOR'!$B$4:$C$1062, 2,FALSE)","v":0},0,0,null,0,0,0]
["MDB147","PRO","EXTRA","Profoam",2,2,9,{"$f":"VLOOKUP(A119, 'GLUE CALCULATOR'!$B$4:$C$1062, 2,FALSE)","v":0},0,0,null,0,0,0]
["MDB150","PRO","EXTRA","Profoam",2,2,22,{"$f":"VLOOKUP(A120, 'GLUE CALCULATOR'!$B$4:$C$1062, 2,FALSE)","v":0},0,0,null,0,0,0]
["MDB152","PRO","EXTRA","Profoam",2,2,17,{"$f":"VLOOKUP(A121, 'GLUE CALCULATOR'!$B$4:$C$1062, 2,FALSE)","v":0},0,0,null,0,0,0]
["MDB154","PRO","EXTRA","Profoam",2,3,31,{"$f":"VLOOKUP(A122, 'GLUE CALCULATOR'!$B$4:$C$1062, 2,FALSE)","v":0},0,0,null,0,0,0]
["MDB155","PRO","EXTRA","Profoam",2,4,86,{"$f":"VLOOKUP(A123, 'GLUE CALCULATOR'!$B$4:$C$1062, 2,FALSE)","v":0},0,0,null,0,0,0]
["MDB158","PRO","EXTRA","Profoam",2,3,22,{"$f":"VLOOKUP(A124, 'GLUE CALCULATOR'!$B$4:$C$1062, 2,FALSE)","v":0},0,0,null,0,0,0]
["MDB162","PRO","EXTRA","Profoam",2,2,14,{"$f":"VLOOKUP(A125, 'GLUE CALCULATOR'!$B$4:$C$1062, 2,FALSE)","v":0},0,0,null,0,0,0]
["MDB163","PRO","EXTRA","Profoam",2,2,21,{"$f":"VLOOKUP(A126, 'GLUE CALCULATOR'!$B$4:$C$1062, 2,FALSE)","v":0},0,0,null,0,0,0]
["MDB164","PRO","EXTRA","Profoam",2,2,8,{"$f":"VLOOKUP(A127, 'GLUE CALCULATOR'!$B$4:$C$1062, 2,FALSE)","v":0},0,0,null,0,0,0]
["MDB165","PRO","EXTRA","Profoam",2,2,12,{"$f":"VLOOKUP(A128, 'GLUE CALCULATOR'!$B$4:$C$1062, 2,FALSE)","v":0},0,0,null,0,0,0]
["MDB167","PRO","EXTRA","Profoam",2,2,10,{"$f":"VLOOKUP(A129, 'GLUE CALCULATOR'!$B$4:$C$1062, 2,FALSE)","v":0},0,0,null,0,0,0]
["MDB169","PRO","EXTRA","Profoam",2,3,27,{"$f":"VLOOKUP(A130, 'GLUE CALCULATOR'!$B$4:$C$1062, 2,FALSE)","v":0},0,0,null,0,0,0]
["MDB174","PRO","EXTRA","Profoam",2,2,10,{"$f":"VLOOKUP(A131, 'GLUE CALCULATOR'!$B$4:$C$1062, 2,FALSE)","v":0},0,0,null,0,0,0]
["MDB180","PRO","EXTRA","Profoam",2,1,3,{"$f":"VLOOKUP(A132, 'GLUE CALCULATOR'!$B$4:$C$1062, 2,FALSE)","v":0},0,0,null,0,0,0]
["MDB185","PRO","EXTRA","Profoam",2,2,12,{"$f":"VLOOKUP(A133, 'GLUE CALCULATOR'!$B$4:$C$1062, 2,FALSE)","v":0},0,0,null,0,0,0]
["MDB214","PRO","EXTRA","Profoam",2,3,25,{"$f":"VLOOKUP(A134, 'GLUE CALCULATOR'!$B$4:$C$1062, 2,FALSE)","v":0},0,0,null,0,0,0]
["MDC217","PRO","EXTRA","Profoam",2,2,10,{"$f":"VLOOKUP(A135, 'GLUE CALCULATOR'!$B$4:$C$1062, 2,FALSE)","v":0},0,0,null,0,0,0]
["MDC236","PRO","EXTRA","Profoam",2,2,16,{"$f":"VLOOKUP(A136, 'GLUE CALCULATOR'!$B$4:$C$1062, 2,FALSE)","v":0},0,0,null,0,0,0]
["MDC239","PRO","EXTRA","Profoam",2,2,10,{"$f":"VLOOKUP(A137, 'GLUE CALCULATOR'!$B$4:$C$1062, 2,FALSE)","v":0},0,0,null,{"$f":"J137","v":0},{"$f":"H137*(G137/100)","v":0},{"$f":"(M137+M137*50%)*$H$1","v":0}]
["MDC250","PRO","EXTRA","Profoam",2,2,10,{"$f":"VLOOKUP(A138, 'GLUE CALCULATOR'!$B$4:$C$1062, 2,FALSE)","v":0},0,0,null,0,0,0]
["MDC252","PRO","EXTRA","Profoam",2,2,5,{"$f":"VLOOKUP(A139, 'GLUE CALCULATOR'!$B$4:$C$1062, 2,FALSE)","v":0},0,0,null,0,0,0]
["MDC255","PRO","EXTRA","Profoam",2,2,7,{"$f":"VLOOKUP(A140, 'GLUE CALCULATOR'!$B$4:$C$1062, 2,FALSE)","v":0},{"$f":"H140*E140*F140","v":0},{"$f":"ROUND(I140*$H$1, 4)","v":0},null,0,0,0]
["MDC258","PRO","EXTRA","Profoam",2,2,7,{"$f":"VLOOKUP(A141, 'GLUE CALCULATOR'!$B$4:$C$1062, 2,FALSE)","v":0},0,0,null,0,0,0]
["MDD305","PRO","EXTRA","Profoam",2,2,12,{"$f":"VLOOKUP(A142, 'GLUE CALCULATOR'!$B$4:$C$1062, 2,FALSE)","v":0},0,0,null,0,0,0]
["MDD311","PRO","EXTRA","Profoam",2,2,13,{"$f":"VLOOKUP(A143, 'GLUE CALCULATOR'!$B$4:$C$1062, 2,FALSE)","v":0},0,0,null,0,0,0]
["MDD315","PRO","EXTRA","Profoam",2,4,36,{"$f":"VLOOKUP(A144, 'GLUE CALCULATOR'!$B$4:$C$1062, 2,FALSE)","v":0},0,0,null,0,0,0]
["MDD316","PRO","EXTRA","Profoam",2,1,2,{"$f":"VLOOKUP(A145, 'GLUE CALCULATOR'!$B$4:$C$1062, 2,FALSE)","v":0},0,0,null,0,0,0]
["MDD332","PRO","EXTRA","Profoam",2,2,7,{"$f":"VLOOKUP(A146, 'GLUE CALCULATOR'!$B$4:$C$1062, 2,FALSE)","v":0},0,0,null,0,0,0]
["MDD334","PRO","EXTRA","Profoam",2,2,13,{"$f":"VLOOKUP(A147, 'GLUE CALCULATOR'!$B$4:$C$1062, 2,FALSE)","v":0},0,0,null,0,0,0]
["MDD335","PRO","EXTRA","Profoam",2,3,23,{"$f":"VLOOKUP(A148, 'GLUE CALCULATOR'!$B$4:$C$1062, 2,FALSE)","v":0},0,0,null,0,0,0]
["MDD338","PRO","EXTRA","Profoam",2,2,10,{"$f":"VLOOKUP(A149, 'GLUE CALCULATOR'!$B$4:$C$1062, 2,FALSE)","v":0},0,0,null,0,0,0]
["MDD339","PRO","EXTRA","Profoam",2,2,10,{"$f":"VLOOKUP(A150, 'GLUE CALCULATOR'!$B$4:$C$1062, 2,FALSE)","v":0},0,0,null,0,0,0]
["MDD345","PRO","EXTRA","Profoam",2,2,14,{"$f":"VLOOKUP(A151, 'GLUE CALCULATOR'!$B$4:$C$1062, 2,FALSE)","v":0},0,0,null,0,0,0]
["MDD351","PRO","EXTRA","Profoam",2,2,12,{"$f":"VLOOKUP(A152, 'GLUE CALCULATOR'!$B$4:$C$1062, 2,FALSE)","v":0},0,0,null,0,0,0]
["MDD410","PRO","EXTRA","Profoam",2,2,14,{"$f":"VLOOKUP(A153, 'GLUE CALCULATOR'!$B$4:$C$1062, 2,FALSE)","v":0},0,0,null,0,0,0]
["MDD412","PRO","EXTRA","Profoam",2,2,10,{"$f":"VLOOKUP(A154, 'GLUE CALCULATOR'!$B$4:$C$1062, 2,FALSE)","v":0},0,0,null,0,0,0]
["MDD414","PRO","EXTRA","Profoam",2,2,7,{"$f":"VLOOKUP(A155, 'GLUE CALCULATOR'!$B$4:$C$1062, 2,FALSE)","v":0},0,0,null,0,0,0]
["QL001","PRO","EXTRA","Polyforce",2,4,35,{"$f":"VLOOKUP(A156, 'GLUE CALCULATOR'!$B$4:$C$1062, 2,FALSE)","v":0},0,0,null,0,0,0]
["QL002","PRO","EXTRA","Polyforce",2,3,21,{"$f":"VLOOKUP(A157, 'GLUE CALCULATOR'!$B$4:$C$1062, 2,FALSE)","v":0},0,0,null,0,0,0]
["QL006","PRO","EXTRA","Polyforce",2,2,12,{"$f":"VLOOKUP(A158, 'GLUE CALCULATOR'!$B$4:$C$1062, 2,FALSE)","v":0},0,0,null,0,0,0]
["QL007","PRO","EXTRA","Polyforce",2,2,16,{"$f":"VLOOKUP(A159, 'GLUE CALCULATOR'!$B$4:$C$1062, 2,FALSE)","v":0},0,0,null,0,0,0]
["QL009","PRO","EXTRA","Polyforce",2,3,25,{"$f":"VLOOKUP(A160, 'GLUE CALCULATOR'!$B$4:$C$1062, 2,FALSE)","v":0},0,0,null,0,0,0]
["QL010","PRO","EXTRA","Polyforce",2,3,25,{"$f":"VLOOKUP(A161, 'GLUE CALCULATOR'!$B$4:$C$1062, 2,FALSE)","v":0},0,0,null,0,0,0]
["QL011","MAX","EXTRA","Polyforce",2,3,30,{"$f":"VLOOKUP(A162, 'GLUE CALCULATOR'!$B$4:$C$1062, 2,FALSE)","v":0},0,null,null,null,0,0,{"$f":"ROUND(I162*$H$1, 4)","v":0}]
["QL017","PRO","EXTRA","Polyforce",2,2,18,{"$f":"VLOOKUP(A163, 'GLUE CALCULATOR'!$B$4:$C$1062, 2,FALSE)","v":0},0,0,null,0,0,0]
["QL019","PRO","EXTRA","Polyforce",2,2,15,{"$f":"VLOOKUP(A164, 'GLUE CALCULATOR'!$B$4:$C$1062, 2,FALSE)","v":0},0,0,null,0,0,0]
["QL021","PRO","EXTRA","Polyforce",2,1,5,{"$f":"VLOOKUP(A165, 'GLUE CALCULATOR'!$B$4:$C$1062, 2,FALSE)","v":0},0,0,null,0,0,0]
["QL022","PRO","EXTRA","Polyforce",2,1,3,{"$f":"VLOOKUP(A166, 'GLUE CALCULATOR'!$B$4:$C$1062, 2,FALSE)","v":0},0,0,null,0,0,0]
["QL023","PRO","EXTRA","Polyforce",2,1,5,{"$f":"VLOOKUP(A167, 'GLUE CALCULATOR'!$B$4:$C$1062, 2,FALSE)","v":0},0,0,null,0,0,0]
["QL024","MAX","EXTRA","Polyforce",2,4,10,{"$f":"VLOOKUP(A168, 'GLUE CALCULATOR'!$B$4:$C$1062, 2,FALSE)","v":0},{"$f":"H168*E168*F168","v":0},null,null,null,{"$f":"H168*(G168/100)","v":0},{"$f":"(M168+M168*50%)*$H$1","v":0},{"$f":"ROUND(I168*$H$1, 4)","v":0}]
["QL025","MAX","EXTRA","Polyforce",2,5,16,{"$f":"VLOOKUP(A169, 'GLUE CALCULATOR'!$B$4:$C$1062, 2,FALSE)","v":0},0,null,null,null,0,0,0]
["QL026","MAX","EXTRA","Polyforce",2.4,2,25,{"$f":"VLOOKUP(A170, 'GLUE CALCULATOR'!$B$4:$C$1062, 2,FALSE)","v":0},0,null,null,null,0,0,0]
["QL026T","MAX","EXTRA","Polyforce",2,2,25,{"$f":"VLOOKUP(A171, 'GLUE CALCULATOR'!$B$4:$C$1062, 2,FALSE)","v":0},0,null,null,null,0,0,0]
["QL026H","MAX","EXTRA","Polyforce",3,2,25,{"$f":"VLOOKUP(A172, 'GLUE CALCULATOR'!$B$4:$C$1062, 2,FALSE)","v":0},{"$f":"H172*E172*F172","v":0},null,null,null,{"$f":"H172*(G172/100)","v":0},{"$f":"(M172+M172*50%)*$H$1","v":0},0]
["QL027","MAX","EXTRA","Polyforce",2,2,24,{"$f":"VLOOKUP(A173, 'GLUE CALCULATOR'!$B$4:$C$1062, 2,FALSE)","v":0},0,null,null,null,0,0,0]
["QL035","MAX","EXTRA","Polyforce",2.4,2,25,{"$f":"VLOOKUP(A174, 'GLUE CALCULATOR'!$B$4:$C$1062, 2,FALSE)","v":0},0,null,null,null,0,0,0]
["QL035T","MAX","EXTRA","Polyforce",2,2,25,{"$f":"VLOOKUP(A175, 'GLUE CALCULATOR'!$B$4:$C$1062, 2,FALSE)","v":0},0,null,null,null,0,0,0]
["QL035H","MAX","EXTRA","Polyforce",3,2,25,{"$f":"VLOOKUP(A176, 'GLUE CALCULATOR'!$B$4:$C$1062, 2,FALSE)","v":0},{"$f":"H176*E176*F176","v":0},null,null,null,{"$f":"H176*(G176/100)","v":0},{"$f":"(M176+M176*50%)*$H$1","v":0},0]
["QL036","MAX","EXTRA","Polyforce",2.4,3,30,{"$f":"VLOOKUP(A177, 'GLUE CALCULATOR'!$B$4:$C$1062, 2,FALSE)","v":0},0,null,null,null,0,0,0]
["QL036T","MAX","EXTRA","Polyforce",2,3,30,{"$f":"VLOOKUP(A178, 'GLUE CALCULATOR'!$B$4:$C$1062, 2,FALSE)","v":0},0,null,null,null,0,0,0]
["QL036H","MAX","EXTRA","Polyforce",3,3,30,{"$f":"VLOOKUP(A179, 'GLUE CALCULATOR'!$B$4:$C$1062, 2,FALSE)","v":0},{"$f":"H179*E179*F179","v":0},null,null,null,{"$f":"H179*(G179/100)","v":0},{"$f":"(M179+M179*50%)*$H$1","v":0},0]
["QL046","MAX","EXTRA","Polyforce",2.4,3,30,{"$f":"VLOOKUP(A180, 'GLUE CALCULATOR'!$B$4:$C$1062, 2,FALSE)","v":0},0,null,null,null,0,0,0]
["QL046T","MAX","EXTRA","Polyforce",2,3,30,{"$f":"VLOOKUP(A181, 'GLUE CALCULATOR'!$B$4:$C$1062, 2,FALSE)","v":0},0,null,null,null,0,0,0]
["QL056","MAX","EXTRA","Polyforce",2.4,4,40,{"$f":"VLOOKUP(A182, 'GLUE CALCULATOR'!$B$4:$C$1062, 2,FALSE)","v":0},0,null,null,null,0,0,0]
["QL056T","MAX","EXTRA","Polyforce",2,4,40,{"$f":"VLOOKUP(A183, 'GLUE CALCULATOR'!$B$4:$C$1062, 2,FALSE)","v":0},0,null,null,null,0,0,0]
["QS003","PRO","EXTRA","Polyforce",2,3,20,{"$f":"VLOOKUP(A184, 'GLUE CALCULATOR'!$B$4:$C$1062, 2,FALSE)","v":0},0,0,null,0,0,0]
["QS004","PRO","EXTRA","Polyforce",2,2,15,{"$f":"VLOOKUP(A185, 'GLUE CALCULATOR'!$B$4:$C$1062, 2,FALSE)","v":0},0,0,null,0,0,0]
["QS009","PRO","EXTRA","Polyforce",2,2,15,{"$f":"VLOOKUP(A186, 'GLUE CALCULATOR'!$B$4:$C$1062, 2,FALSE)","v":0},0,0,null,0,0,0]
["QS011","PRO","EXTRA","Polyforce",2,3,20,{"$f":"VLOOKUP(A187, 'GLUE CALCULATOR'!$B$4:$C$1062, 2,FALSE)","v":0},0,0,null,0,0,0]
["MD001P","PRO","EXTRA","Polyforce",2,2,3,{"$f":"VLOOKUP(A188, 'GLUE CALCULATOR'!$B$4:$C$1062, 2,FALSE)","v":0},0,0,null,0,0,0]
["MD004P","PRO","EXTRA","Polyforce",2,2,7,{"$f":"VLOOKUP(A189, 'GLUE CALCULATOR'!$B$4:$C$1062, 2,FALSE)","v":0},0,0,null,0,0,0]
["MD005P","PRO","EXTRA","Polyforce",2,3,16,{"$f":"VLOOKUP(A190, 'GLUE CALCULATOR'!$B$4:$C$1062, 2,FALSE)","v":0},0,0,null,0,0,0]
["MD006P","PRO","EXTRA","Polyforce",2,3,16,{"$f":"VLOOKUP(A191, 'GLUE CALCULATOR'!$B$4:$C$1062, 2,FALSE)","v":0},0,0,null,0,0,0]
["MD008P","PRO","EXTRA","Polyforce",2,2,9,{"$f":"VLOOKUP(A192, 'GLUE CALCULATOR'!$B$4:$C$1062, 2,FALSE)","v":0},0,0,null,0,0,0]
["MD009P","PRO","EXTRA","Polyforce",2,2,10,{"$f":"VLOOKUP(A193, 'GLUE CALCULATOR'!$B$4:$C$1062, 2,FALSE)","v":0},0,0,null,0,0,0]
["MD011P","PRO","EXTRA","Polyforce",2,2,4,{"$f":"VLOOKUP(A194, 'GLUE CALCULATOR'!$B$4:$C$1062, 2,FALSE)","v":0},0,0,null,0,0,0]
["MD013P","PRO","EXTRA","Polyforce",2,2,10,{"$f":"VLOOKUP(A195, 'GLUE CALCULATOR'!$B$4:$C$1062, 2,FALSE)","v":0},0,0,null,0,0,0]
["MD014P","PRO","EXTRA","Polyforce",2,3,8,{"$f":"VLOOKUP(A196, 'GLUE CALCULATOR'!$B$4:$C$1062, 2,FALSE)","v":0},0,0,null,0,0,0]
["MD016P","PRO","EXTRA","Polyforce",2,2,10,{"$f":"VLOOKUP(A197, 'GLUE CALCULATOR'!$B$4:$C$1062, 2,FALSE)","v":0},0,0,null,0,{"$f":"H197*(G197/100)","v":0},{"$f":"(M197+M197*50%)*$H$1","v":0}]
["MD017P","PRO","EXTRA","Polyforce",2,2,7,{"$f":"VLOOKUP(A198, 'GLUE CALCULATOR'!$B$4:$C$1062, 2,FALSE)","v":0},0,0,null,0,0,0]
["MD018P","PRO","EXTRA","Polyforce",2,2,12,{"$f":"VLOOKUP(A199, 'GLUE CALCULATOR'!$B$4:$C$1062, 2,FALSE)","v":0},0,0,null,0,0,0]
["MD020P","PRO","EXTRA","Polyforce",2,4,40,{"$f":"VLOOKUP(A200, 'GLUE CALCULATOR'!$B$4:$C$1062, 2,FALSE)","v":0},0,0,null,0,0,0]
["MD024P","PRO","EXTRA","Polyforce",2,2,16,{"$f":"VLOOKUP(A201, 'GLUE CALCULATOR'!$B$4:$C$1062, 2,FALSE)","v":0},0,0,null,0,0,0]
["MD025P","PRO","EXTRA","Polyforce",2,3,22,{"$f":"VLOOKUP(A202, 'GLUE CALCULATOR'!$B$4:$C$1062, 2,FALSE)","v":0},0,0,null,0,0,0]
["MD027P","PRO","EXTRA","Polyforce",2,2,6,{"$f":"VLOOKUP(A203, 'GLUE CALCULATOR'!$B$4:$C$1062, 2,FALSE)","v":0},0,0,null,0,0,0]
["MD028P","PRO","EXTRA","Polyforce",2,2,6,{"$f":"VLOOKUP(A204, 'GLUE CALCULATOR'!$B$4:$C$1062, 2,FALSE)","v":0},0,0,null,0,0,0]
["MD030P","PRO","EXTRA","Polyforce",2,2,8,{"$f":"VLOOKUP(A205, 'GLUE CALCULATOR'!$B$4:$C$1062, 2,FALSE)","v":0},{"$f":"H205*E205*F205","v":0},{"$f":"ROUND(I205*$H$1, 4)","v":0},null,0,0,0]
["MD032P","PRO","EXTRA","Polyforce",2,2,6,{"$f":"VLOOKUP(A206, 'GLUE CALCULATOR'!$B$4:$C$1062, 2,FALSE)","v":0},0,0,null,{"$f":"J206","v":0},0,0]
["MD094P","PRO","EXTRA","Polyforce",2,2,9.5,{"$f":"VLOOKUP(A207, 'GLUE CALCULATOR'!$B$4:$C$1062, 2,FALSE)","v":0},0,0,null,0,0,0]
["MD095P","PRO","EXTRA","Polyforce",2,3,18,{"$f":"VLOOKUP(A208, 'GLUE CALCULATOR'!$B$4:$C$1062, 2,FALSE)","v":0},0,0,null,0,0,0]
["MD234P","PRO","EXTRA","Polyforce",2,2,10,{"$f":"VLOOKUP(A209, 'GLUE CALCULATOR'!$B$4:$C$1062, 2,FALSE)","v":0},0,0,null,0,0,0]
["MD235P","PRO","EXTRA","Polyforce",2,2,2,{"$f":"VLOOKUP(A210, 'GLUE CALCULATOR'!$B$4:$C$1062, 2,FALSE)","v":0},0,0,null,0,0,0]
["MD236P","PRO","EXTRA","Polyforce",2,2,15,{"$f":"VLOOKUP(A211, 'GLUE CALCULATOR'!$B$4:$C$1062, 2,FALSE)","v":0},0,0,null,0,0,0]
["MD258P","PRO","EXTRA","Polyforce",2,2,12,{"$f":"VLOOKUP(A212, 'GLUE CALCULATOR'!$B$4:$C$1062, 2,FALSE)","v":0},0,0,null,0,0,0]
["MD354P","PRO","EXTRA","Polyforce",2,2,14,{"$f":"VLOOKUP(A213, 'GLUE CALCULATOR'!$B$4:$C$1062, 2,FALSE)","v":0},0,0,null,0,0,0]
["MD355P","PRO","EXTRA","Polyforce",2,3,18,{"$f":"VLOOKUP(A214, 'GLUE CALCULATOR'!$B$4:$C$1062, 2,FALSE)","v":0},0,0,null,0,0,0]
["MD356P","PRO","EXTRA","Polyforce",2,3,20,{"$f":"VLOOKUP(A215, 'GLUE CALCULATOR'!$B$4:$C$1062, 2,FALSE)","v":0},0,0,null,0,0,0]
["MD358P","PRO","EXTRA","Polyforce",2,3,20,{"$f":"VLOOKUP(A216, 'GLUE CALCULATOR'!$B$4:$C$1062, 2,FALSE)","v":0},0,0,null,0,0,0]
["MD359P","PRO","EXTRA","Polyforce",2,2,13,{"$f":"VLOOKUP(A217, 'GLUE CALCULATOR'!$B$4:$C$1062, 2,FALSE)","v":0},0,0,null,0,0,0]
["MD360P","PRO","EXTRA","Polyforce",2,3,25,{"$f":"VLOOKUP(A218, 'GLUE CALCULATOR'!$B$4:$C$1062, 2,FALSE)","v":0},0,0,null,0,0,0]
["MD361P","PRO","EXTRA","Polyforce",2,3,22,{"$f":"VLOOKUP(A219, 'GLUE CALCULATOR'!$B$4:$C$1062, 2,FALSE)","v":0},0,0,null,0,0,0]
["MD363P","PRO","EXTRA","Polyforce",2,2,14,{"$f":"VLOOKUP(A220, 'GLUE CALCULATOR'!$B$4:$C$1062, 2,FALSE)","v":0},0,0,null,0,0,0]
["MD8300P","PRO","EXTRA","Polyforce",2,2,12,{"$f":"VLOOKUP(A221, 'GLUE CALCULATOR'!$B$4:$C$1062, 2,FALSE)","v":0},0,0,null,0,0,0]
["QL007P","PRO","EXTRA","Polyforce",2,2,16,{"$f":"VLOOKUP(A222, 'GLUE CALCULATOR'!$B$4:$C$1062, 2,FALSE)","v":0},0,0,null,0,0,0]
["QL019P","PRO","EXTRA","Polyforce",2,2,15,{"$f":"VLOOKUP(A223, 'GLUE CALCULATOR'!$B$4:$C$1062, 2,FALSE)","v":0},0,0,null,0,0,0]
["QL021P","PRO","EXTRA","Polyforce",2,1,5,{"$f":"VLOOKUP(A224, 'GLUE CALCULATOR'!$B$4:$C$1062, 2,FALSE)","v":0},0,0,null,0,0,0]
["QS003P","PRO","EXTRA","Polyforce",2,3,20,{"$f":"VLOOKUP(A225, 'GLUE CALCULATOR'!$B$4:$C$1062, 2,FALSE)","v":0},0,0,null,0,0,0]
["QS004P","PRO","EXTRA","Polyforce",2,2,15,{"$f":"VLOOKUP(A226, 'GLUE CALCULATOR'!$B$4:$C$1062, 2,FALSE)","v":0},0,0,null,0,0,0]
["QS009P","PRO","EXTRA","Polyforce",2,2,15,{"$f":"VLOOKUP(A227, 'GLUE CALCULATOR'!$B$4:$C$1062, 2,FALSE)","v":0},0,0,null,0,0,0]
["QS011P","PRO","EXTRA","Polyforce",2,3,20,{"$f":"VLOOKUP(A228, 'GLUE CALCULATOR'!$B$4:$C$1062, 2,FALSE)","v":0},0,0,null,0,0,0]
["MD018F","PRO","EXTRA","Flexible Profoam",2,2,12,{"$f":"VLOOKUP(A229, 'GLUE CALCULATOR'!$B$4:$C$1062, 2,FALSE)","v":0},0,0,null,0,0,0]
["MD234F","PRO","EXTRA","Flexible Profoam",2,2,10,{"$f":"VLOOKUP(A230, 'GLUE CALCULATOR'!$B$4:$C$1062, 2,FALSE)","v":0},0,0,null,0,0,0]
["MD355F","PRO","EXTRA","Flexible Profoam",2,3,18,{"$f":"VLOOKUP(A231, 'GLUE CALCULATOR'!$B$4:$C$1062, 2,FALSE)","v":0},0,0,null,0,0,0]
["MD356F","PRO","EXTRA","Flexible Profoam",2,3,20,{"$f":"VLOOKUP(A232, 'GLUE CALCULATOR'!$B$4:$C$1062, 2,FALSE)","v":0},0,0,null,0,0,0]
["MD358F","PRO","EXTRA","Flexible Profoam",2,3,20,{"$f":"VLOOKUP(A233, 'GLUE CALCULATOR'!$B$4:$C$1062, 2,FALSE)","v":0},0,0,null,0,0,0]
["MD359F","PRO","EXTRA","Flexible Profoam",2,2,13,{"$f":"VLOOKUP(A234, 'GLUE CALCULATOR'!$B$4:$C$1062, 2,FALSE)","v":0},0,0,null,0,0,0]
["MD360F","PRO","EXTRA","Flexible Profoam",2,3,25,{"$f":"VLOOKUP(A235, 'GLUE CALCULATOR'!$B$4:$C$1062, 2,FALSE)","v":0},0,0,null,0,0,0]
["MD008E","PRO","EXTRA","Polyforce",2.4,2,9,{"$f":"VLOOKUP(A236, 'GLUE CALCULATOR'!$B$4:$C$1062, 2,FALSE)","v":0},0,0,null,0,0,0]
["MD009E","PRO","EXTRA","Polyforce",2.4,2,10,{"$f":"VLOOKUP(A237, 'GLUE CALCULATOR'!$B$4:$C$1062, 2,FALSE)","v":0},0,0,null,0,0,0]
["MD094E","PRO","EXTRA","Polyforce",2.4,2,9.5,{"$f":"VLOOKUP(A238, 'GLUE CALCULATOR'!$B$4:$C$1062, 2,FALSE)","v":0},0,0,null,0,0,0]
["MD258E","PRO","EXTRA","Polyforce",2.4,2,12,{"$f":"VLOOKUP(A239, 'GLUE CALCULATOR'!$B$4:$C$1062, 2,FALSE)","v":0},0,0,null,0,0,0]
["MD356E","PRO","EXTRA","Polyforce",2.4,3,20,{"$f":"VLOOKUP(A240, 'GLUE CALCULATOR'!$B$4:$C$1062, 2,FALSE)","v":0},0,0,null,0,0,0]
["MD359E","PRO","EXTRA","Polyforce",2.4,2,13,{"$f":"VLOOKUP(A241, 'GLUE CALCULATOR'!$B$4:$C$1062, 2,FALSE)","v":0},0,0,null,0,0,0]
["MD106F","PRO","EXTRA","Flexible Profoam",2,2,10,{"$f":"VLOOKUP(A242, 'GLUE CALCULATOR'!$B$4:$C$1062, 2,FALSE)","v":0},0,0,null,0,0,0]
["MD145F","PRO","EXTRA","Flexible Profoam",2,2,14,{"$f":"VLOOKUP(A243, 'GLUE CALCULATOR'!$B$4:$C$1062, 2,FALSE)","v":0},0,0,null,0,0,0]
["MD213F","MAX","EXTRA","Flexible Profoam",2,2,18,{"$f":"VLOOKUP(A244, 'GLUE CALCULATOR'!$B$4:$C$1062, 2,FALSE)","v":0},0,null,null,null,0,0,{"$f":"ROUND(I244*$H$1, 4)","v":0}]
["MDA005F","PRO","EXTRA","Flexible Profoam",2,2,11,{"$f":"VLOOKUP(A245, 'GLUE CALCULATOR'!$B$4:$C$1062, 2,FALSE)","v":0},0,0,null,0,0,0]
["MDB102F","PRO","EXTRA","Flexible Profoam",2,2,13,{"$f":"VLOOKUP(A246, 'GLUE CALCULATOR'!$B$4:$C$1062, 2,FALSE)","v":0},0,0,null,0,0,0]
["MDB108F","PRO","EXTRA","Flexible Profoam",2,2,20,{"$f":"VLOOKUP(A247, 'GLUE CALCULATOR'!$B$4:$C$1062, 2,FALSE)","v":0},0,0,null,0,0,0]
["MDB110F","MAX","EXTRA","Flexible Profoam",2,2,13,{"$f":"VLOOKUP(A248, 'GLUE CALCULATOR'!$B$4:$C$1062, 2,FALSE)","v":0},0,null,null,null,0,0,{"$f":"ROUND(I248*$H$1, 4)","v":0}]
["MDB112F","PRO","EXTRA","Flexible Profoam",2,2,10,{"$f":"VLOOKUP(A249, 'GLUE CALCULATOR'!$B$4:$C$1062, 2,FALSE)","v":0},0,0,null,0,0,0]
["MDB118F","PRO","EXTRA","Flexible Profoam",2,2,17,{"$f":"VLOOKUP(A250, 'GLUE CALCULATOR'!$B$4:$C$1062, 2,FALSE)","v":0},0,0,null,0,0,0]
["MDB135F","PRO","EXTRA","Flexible Profoam",2,2,5,{"$f":"VLOOKUP(A251, 'GLUE CALCULATOR'!$B$4:$C$1062, 2,FALSE)","v":0},0,0,null,0,0,0]
["MDB169F","PRO","EXTRA","Flexible Profoam",2,3,27,{"$f":"VLOOKUP(A252, 'GLUE CALCULATOR'!$B$4:$C$1062, 2,FALSE)","v":0},0,0,null,0,0,0]
["MDB172F","PRO","EXTRA","Flexible Profoam",2,2,8,{"$f":"VLOOKUP(A253, 'GLUE CALCULATOR'!$B$4:$C$1062, 2,FALSE)","v":0},0,0,null,0,0,0]
["MDB210F","PRO","EXTRA","Flexible Profoam",2,2,8,{"$f":"VLOOKUP(A254, 'GLUE CALCULATOR'!$B$4:$C$1062, 2,FALSE)","v":0},0,0,null,0,0,0]
["MD308F","PRO","EXTRA","Flexible Profoam",2,2,10,{"$f":"VLOOKUP(A255, 'GLUE CALCULATOR'!$B$4:$C$1062, 2,FALSE)","v":0},0,0,null,0,0,0]
["MD314F","PRO","EXTRA","Flexible Profoam",2,2,8,{"$f":"VLOOKUP(A256, 'GLUE CALCULATOR'!$B$4:$C$1062, 2,FALSE)","v":0},0,0,null,0,0,0]
["MD325F","PRO","EXTRA","Flexible Profoam",2,2,6,{"$f":"VLOOKUP(A257, 'GLUE CALCULATOR'!$B$4:$C$1062, 2,FALSE)","v":0},0,0,null,0,0,0]
["MD338F","PRO","EXTRA","Flexible Profoam",2,2,10,{"$f":"VLOOKUP(A258, 'GLUE CALCULATOR'!$B$4:$C$1062, 2,FALSE)","v":0},0,0,null,0,0,0]
["MDC239F","PRO","EXTRA","Flexible Profoam",2,2,10,{"$f":"VLOOKUP(A259, 'GLUE CALCULATOR'!$B$4:$C$1062, 2,FALSE)","v":0},0,0,null,0,0,0]
["MDC250F","PRO","EXTRA","Flexible Profoam",2,2,10,{"$f":"VLOOKUP(A260, 'GLUE CALCULATOR'!$B$4:$C$1062, 2,FALSE)","v":0},0,0,null,0,0,0]
["MDC252F","PRO","EXTRA","Flexible Profoam",2,2,5,{"$f":"VLOOKUP(A261, 'GLUE CALCULATOR'!$B$4:$C$1062, 2,FALSE)","v":0},0,0,null,0,{"$f":"H261*(G261/100)","v":0},{"$f":"(M261+M261*50%)*$H$1","v":0}]
["MDC258F","PRO","EXTRA","Flexible Profoam",2,2,7,{"$f":"VLOOKUP(A262, 'GLUE CALCULATOR'!$B$4:$C$1062, 2,FALSE)","v":0},0,0,null,0,0,0]
["MDD311F","PRO","EXTRA","Flexible Profoam",2,2,13,{"$f":"VLOOKUP(A263, 'GLUE CALCULATOR'!$B$4:$C$1062, 2,FALSE)","v":0},0,0,null,0,0,0]
["MDD332F","PRO","EXTRA","Flexible Profoam",2,2,7,{"$f":"VLOOKUP(A264, 'GLUE CALCULATOR'!$B$4:$C$1062, 2,FALSE)","v":0},0,0,null,0,0,0]
["MDD338F","PRO","EXTRA","Flexible Profoam",2,2,10,{"$f":"VLOOKUP(A265, 'GLUE CALCULATOR'!$B$4:$C$1062, 2,FALSE)","v":0},0,0,null,0,0,0]
["MDD339F","PRO","EXTRA","Flexible Profoam",2,2,10,{"$f":"VLOOKUP(A266, 'GLUE CALCULATOR'!$B$4:$C$1062, 2,FALSE)","v":0},0,0,null,0,0,0]
["MDD345F","PRO","EXTRA","Flexible Profoam",2,2,14,{"$f":"VLOOKUP(A267, 'GLUE CALCULATOR'!$B$4:$C$1062, 2,FALSE)","v":0},0,0,null,0,0,0]
["MDD346F","PRO","EXTRA","Flexible Profoam",2,2,9,{"$f":"VLOOKUP(A268, 'GLUE CALCULATOR'!$B$4:$C$1062, 2,FALSE)","v":0},0,0,null,0,0,0]
["MDD414F","PRO","EXTRA","Flexible Profoam",2,2,7,{"$f":"VLOOKUP(A269, 'GLUE CALCULATOR'!$B$4:$C$1062, 2,FALSE)","v":0},0,0,null,{"$f":"J269","v":0},{"$f":"H269*(G269/100)","v":0},{"$f":"(M269+M269*50%)*$H$1","v":0}]
["BW001T","PRO","PRO","Polyforce",2,3,12,{"$f":"VLOOKUP(A270, 'GLUE CALCULATOR'!$B$4:$C$1062, 2,FALSE)","v":0},{"$f":"H270*E270*F270","v":0},{"$f":"ROUND(I270*$H$1, 4)","v":0},{"$f":"ROUND(H270*(G270/100)*$H$1, 4)","v":0},{"$f":"J270+K270","v":0}]
["BW001LT","PRO","PRO","Polyforce",2,3,12,{"$f":"VLOOKUP(A271, 'GLUE CALCULATOR'!$B$4:$C$1062, 2,FALSE)","v":0},0,0,0,0]
["BW001RT","PRO","PRO","Polyforce",2,3,12,{"$f":"VLOOKUP(A272, 'GLUE CALCULATOR'!$B$4:$C$1062, 2,FALSE)","v":0},0,0,0,0]
["TP001","PRO","EXTRA","Polyforce",2,1,3,{"$f":"VLOOKUP(A273, 'GLUE CALCULATOR'!$B$4:$C$1062, 2,FALSE)","v":0},0,0,null,{"$f":"J273","v":0},{"$f":"H273*(G273/100)","v":0},{"$f":"(M273+M273*50%)*$H$1","v":0}]
["TP002","PRO","EXTRA","Polyforce",2,1,3,{"$f":"VLOOKUP(A274, 'GLUE CALCULATOR'!$B$4:$C$1062, 2,FALSE)","v":0},0,0,null,0,0,0]
["TP003","PRO","EXTRA","Polyforce",2,1,3,{"$f":"VLOOKUP(A275, 'GLUE CALCULATOR'!$B$4:$C$1062, 2,FALSE)","v":0},0,0,null,0,0,0]
["TP004","PRO","EXTRA","Polyforce",2,2,3,{"$f":"VLOOKUP(A276, 'GLUE CALCULATOR'!$B$4:$C$1062, 2,FALSE)","v":0},0,0,null,0,0,0]
["TP005","PRO","EXTRA","Polyforce",2,2,4,{"$f":"VLOOKUP(A277, 'GLUE CALCULATOR'!$B$4:$C$1062, 2,FALSE)","v":0},0,0,null,0,0,0]
["BW001TP","PRO","PRO","Polyforce",2,3,12,{"$f":"VLOOKUP(A278, 'GLUE CALCULATOR'!$B$4:$C$1062, 2,FALSE)","v":0},{"$f":"H278*E278*F278","v":0},{"$f":"ROUND(I278*$H$1, 4)","v":0},{"$f":"ROUND(H278*(G278/100)*$H$1, 4)","v":0},{"$f":"J278+K278","v":0}]
["BW001LTP","PRO","PRO","Polyforce",2,3,12,{"$f":"VLOOKUP(A279, 'GLUE CALCULATOR'!$B$4:$C$1062, 2,FALSE)","v":0},0,0,0,0]
["BW001RTP","PRO","PRO","Polyforce",2,3,12,{"$f":"VLOOKUP(A280, 'GLUE CALCULATOR'!$B$4:$C$1062, 2,FALSE)","v":0},0,0,0,0]
["TP001P","PRO","EXTRA","Polyforce",2,1,3,{"$f":"VLOOKUP(A281, 'GLUE CALCULATOR'!$B$4:$C$1062, 2,FALSE)","v":0},0,0,null,{"$f":"J281","v":0},{"$f":"H281*(G281/100)","v":0},{"$f":"(M281+M281*50%)*$H$1","v":0}]
["TP002P","PRO","EXTRA","Polyforce",2,1,3,{"$f":"VLOOKUP(A282, 'GLUE CALCULATOR'!$B$4:$C$1062, 2,FALSE)","v":0},0,0,null,0,0,0]
["TP003P","PRO","EXTRA","Polyforce",2,1,3,{"$f":"VLOOKUP(A283, 'GLUE CALCULATOR'!$B$4:$C$1062, 2,FALSE)","v":0},0,0,null,0,0,0]
["TP004P","PRO","EXTRA","Polyforce",2,2,3,{"$f":"VLOOKUP(A284, 'GLUE CALCULATOR'!$B$4:$C$1062, 2,FALSE)","v":0},0,0,null,0,0,0]
["TP005P","PRO","EXTRA","Polyforce",2,2,4,{"$f":"VLOOKUP(A285, 'GLUE CALCULATOR'!$B$4:$C$1062, 2,FALSE)","v":0},0,0,null,0,0,0]
["WP001","PRO","EXTRA","Polyforce",2.7,5,31,{"$f":"VLOOKUP(A286, 'GLUE CALCULATOR'!$B$4:$C$1062, 2,FALSE)","v":0},{"$f":"H286*E286*F286","v":0},{"$f":"ROUND(I286*$H$1, 4)","v":0},{"$f":"ROUND(H286*(G286/100)*$H$1, 4)","v":0},{"$f":"J286+K286","v":0}]
["WP001L","PRO","EXTRA","Polyforce",2.7,2,5,{"$f":"VLOOKUP(A287, 'GLUE CALCULATOR'!$B$4:$C$1062, 2,FALSE)","v":0},0,0,0,0]
["WP001R","PRO","EXTRA","Polyforce",2.7,2,6,{"$f":"VLOOKUP(A288, 'GLUE CALCULATOR'!$B$4:$C$1062, 2,FALSE)","v":0},0,0,0,0]
["WP002","PRO","EXTRA","Polyforce",2.7,5,33,{"$f":"VLOOKUP(A289, 'GLUE CALCULATOR'!$B$4:$C$1062, 2,FALSE)","v":0},0,0,0,0]
["WP002L","PRO","EXTRA","Polyforce",2.7,2,4,{"$f":"VLOOKUP(A290, 'GLUE CALCULATOR'!$B$4:$C$1062, 2,FALSE)","v":0},0,0,0,0]
["WP002R","PRO","EXTRA","Polyforce",2.7,2,5,{"$f":"VLOOKUP(A291, 'GLUE CALCULATOR'!$B$4:$C$1062, 2,FALSE)","v":0},0,0,0,0]
["WP003","PRO","EXTRA","Polyforce",2.7,5,33,{"$f":"VLOOKUP(A292, 'GLUE CALCULATOR'!$B$4:$C$1062, 2,FALSE)","v":0},0,0,0,0]
["WP003L","PRO","EXTRA","Polyforce",2.7,2,4,{"$f":"VLOOKUP(A293, 'GLUE CALCULATOR'!$B$4:$C$1062, 2,FALSE)","v":0},0,0,0,0]
["WP003R","PRO","EXTRA","Polyforce",2.7,2,5,{"$f":"VLOOKUP(A294, 'GLUE CALCULATOR'!$B$4:$C$1062, 2,FALSE)","v":0},0,0,0,0]
["WP001T","PRO","EXTRA","Polyforce",2,5,31,{"$f":"VLOOKUP(A295, 'GLUE CALCULATOR'!$B$4:$C$1062, 2,FALSE)","v":0},{"$f":"H295*E295*F295","v":0},{"$f":"ROUND(I295*$H$1, 4)","v":0},{"$f":"ROUND(H295*(G295/100)*$H$1, 4)","v":0},{"$f":"J295+K295","v":0}]
["WP001RT","PRO","EXTRA","Polyforce",2,2,5,{"$f":"VLOOKUP(A296, 'GLUE CALCULATOR'!$B$4:$C$1062, 2,FALSE)","v":0},0,0,0,0]
["WP001LT","PRO","EXTRA","Polyforce",2,2,6,{"$f":"VLOOKUP(A297, 'GLUE CALCULATOR'!$B$4:$C$1062, 2,FALSE)","v":0},0,0,0,0]
["WP002T","PRO","EXTRA","Polyforce",2,5,33,{"$f":"VLOOKUP(A298, 'GLUE CALCULATOR'!$B$4:$C$1062, 2,FALSE)","v":0},0,0,0,0]
["WP002RT","PRO","EXTRA","Polyforce",2,2,4,{"$f":"VLOOKUP(A299, 'GLUE CALCULATOR'!$B$4:$C$1062, 2,FALSE)","v":0},0,0,0,0]
["WP002LT","PRO","EXTRA","Polyforce",2,2,5,{"$f":"VLOOKUP(A300, 'GLUE CALCULATOR'!$B$4:$C$1062, 2,FALSE)","v":0},0,0,0,0]
["WP003T","PRO","EXTRA","Polyforce",2,5,33,{"$f":"VLOOKUP(A301, 'GLUE CALCULATOR'!$B$4:$C$1062, 2,FALSE)","v":0},0,0,0,0]
["WP003RT","PRO","EXTRA","Polyforce",2,2,4,{"$f":"VLOOKUP(A302, 'GLUE CALCULATOR'!$B$4:$C$1062, 2,FALSE)","v":0},0,0,0,0]
["WP003LT","PRO","EXTRA","Polyforce",2,2,5,{"$f":"VLOOKUP(A303, 'GLUE CALCULATOR'!$B$4:$C$1062, 2,FALSE)","v":0},0,0,0,0]
["WP001P","PRO","EXTRA","Polyforce",2.7,5,31,{"$f":"VLOOKUP(A304, 'GLUE CALCULATOR'!$B$4:$C$1062, 2,FALSE)","v":0},0,0,0,0]
["WP001RP","PRO","EXTRA","Polyforce",2.7,2,5,{"$f":"VLOOKUP(A305, 'GLUE CALCULATOR'!$B$4:$C$1062, 2,FALSE)","v":0},0,0,0,0]
["WP001LP","PRO","EXTRA","Polyforce",2.7,2,6,{"$f":"VLOOKUP(A306, 'GLUE CALCULATOR'!$B$4:$C$1062, 2,FALSE)","v":0},0,0,0,0]
["WP002P","PRO","EXTRA","Polyforce",2.7,5,33,{"$f":"VLOOKUP(A307, 'GLUE CALCULATOR'!$B$4:$C$1062, 2,FALSE)","v":0},0,0,0,0]
["WP002RP","PRO","EXTRA","Polyforce",2.7,2,4,{"$f":"VLOOKUP(A308, 'GLUE CALCULATOR'!$B$4:$C$1062, 2,FALSE)","v":0},0,0,0,0]
["WP002LP","PRO","EXTRA","Polyforce",2.7,2,5,{"$f":"VLOOKUP(A309, 'GLUE CALCULATOR'!$B$4:$C$1062, 2,FALSE)","v":0},0,0,0,0]
["WP003P","PRO","EXTRA","Polyforce",2.7,5,33,{"$f":"VLOOKUP(A310, 'GLUE CALCULATOR'!$B$4:$C$1062, 2,FALSE)","v":0},0,0,0,0]
["WP003RP","PRO","EXTRA","Polyforce",2.7,2,4,{"$f":"VLOOKUP(A311, 'GLUE CALCULATOR'!$B$4:$C$1062, 2,FALSE)","v":0},0,0,0,0]
["WP003LP","PRO","EXTRA","Polyforce",2.7,2,5,{"$f":"VLOOKUP(A312, 'GLUE CALCULATOR'!$B$4:$C$1062, 2,FALSE)","v":0},0,0,0,0]
["WP001TP","PRO","EXTRA","Polyforce",2,5,31,{"$f":"VLOOKUP(A313, 'GLUE CALCULATOR'!$B$4:$C$1062, 2,FALSE)","v":0},0,0,0,0]
["WP001RTP","PRO","EXTRA","Polyforce",2,2,5,{"$f":"VLOOKUP(A314, 'GLUE CALCULATOR'!$B$4:$C$1062, 2,FALSE)","v":0},0,0,0,0]
["WP001LTP","PRO","EXTRA","Polyforce",2,2,6,{"$f":"VLOOKUP(A315, 'GLUE CALCULATOR'!$B$4:$C$1062, 2,FALSE)","v":0},0,0,0,0]
["WP002TP","PRO","EXTRA","Polyforce",2,5,33,{"$f":"VLOOKUP(A316, 'GLUE CALCULATOR'!$B$4:$C$1062, 2,FALSE)","v":0},0,0,0,0]
["WP002RTP","PRO","EXTRA","Polyforce",2,2,4,{"$f":"VLOOKUP(A317, 'GLUE CALCULATOR'!$B$4:$C$1062, 2,FALSE)","v":0},0,0,0,0]
["WP002LTP","PRO","EXTRA","Polyforce",2,2,5,{"$f":"VLOOKUP(A318, 'GLUE CALCULATOR'!$B$4:$C$1062, 2,FALSE)","v":0},0,0,0,0]
["WP003TP","PRO","EXTRA","Polyforce",2,5,33,{"$f":"VLOOKUP(A319, 'GLUE CALCULATOR'!$B$4:$C$1062, 2,FALSE)","v":0},0,0,0,0]
["WP003RTP","PRO","EXTRA","Polyforce",2,2,4,{"$f":"VLOOKUP(A320, 'GLUE CALCULATOR'!$B$4:$C$1062, 2,FALSE)","v":0},0,0,0,0]
["WP003LTP","PRO","EXTRA","Polyforce",2,2,5,{"$f":"VLOOKUP(A321, 'GLUE CALCULATOR'!$B$4:$C$1062, 2,FALSE)","v":0},0,0,0,0]
["WP003A","PRO","EXTRA","Polyforce",2.7,2,10,{"$f":"VLOOKUP(A322, 'GLUE CALCULATOR'!$B$4:$C$1062, 2,FALSE)","v":0},0,0,0,0]
["WP003AP","PRO","EXTRA","Polyforce",2.7,2,10,{"$f":"VLOOKUP(A323, 'GLUE CALCULATOR'!$B$4:$C$1062, 2,FALSE)","v":0},0,0,0,0]
["WP003AT","PRO","EXTRA","Polyforce",2,2,10,{"$f":"VLOOKUP(A324, 'GLUE CALCULATOR'!$B$4:$C$1062, 2,FALSE)","v":0},0,0,0,0]
["WP003ATP","PRO","EXTRA","Polyforce",2,2,10,{"$f":"VLOOKUP(A325, 'GLUE CALCULATOR'!$B$4:$C$1062, 2,FALSE)","v":0},0,0,0,0]
["WP004","PRO","EXTRA","Polyforce",2.7,3,29,{"$f":"VLOOKUP(A326, 'GLUE CALCULATOR'!$B$4:$C$1062, 2,FALSE)","v":0},{"$f":"H326*E326*F326","v":0},{"$f":"ROUND(I326*$H$1, 4)","v":0},{"$f":"ROUND(H326*(G326/100)*$H$1, 4)","v":0},{"$f":"J326+K326","v":0}]
["WP004R","PRO","EXTRA","Polyforce",2.7,2,6,{"$f":"VLOOKUP(A327, 'GLUE CALCULATOR'!$B$4:$C$1062, 2,FALSE)","v":0},0,0,0,0]
["WP004L","PRO","EXTRA","Polyforce",2.7,2,6,{"$f":"VLOOKUP(A328, 'GLUE CALCULATOR'!$B$4:$C$1062, 2,FALSE)","v":0},0,0,0,0]
["WP004T","PRO","EXTRA","Polyforce",2,3,29,{"$f":"VLOOKUP(A329, 'GLUE CALCULATOR'!$B$4:$C$1062, 2,FALSE)","v":0},0,0,0,0]
["WP004RT","PRO","EXTRA","Polyforce",2,2,6,{"$f":"VLOOKUP(A330, 'GLUE CALCULATOR'!$B$4:$C$1062, 2,FALSE)","v":0},0,0,0,0]
["WP004LT","PRO","EXTRA","Polyforce",2,2,6,{"$f":"VLOOKUP(A331, 'GLUE CALCULATOR'!$B$4:$C$1062, 2,FALSE)","v":0},0,0,0,0]
["WP004P","PRO","EXTRA","Polyforce",2.7,3,29,{"$f":"VLOOKUP(A332, 'GLUE CALCULATOR'!$B$4:$C$1062, 2,FALSE)","v":0},0,0,0,0]
["WP004RP","PRO","EXTRA","Polyforce",2.7,2,6,{"$f":"VLOOKUP(A333, 'GLUE CALCULATOR'!$B$4:$C$1062, 2,FALSE)","v":0},0,0,0,0]
["WP004LP","PRO","EXTRA","Polyforce",2.7,2,6,{"$f":"VLOOKUP(A334, 'GLUE CALCULATOR'!$B$4:$C$1062, 2,FALSE)","v":0},0,0,0,0]
["WP004TP","PRO","EXTRA","Polyforce",2,3,29,{"$f":"VLOOKUP(A335, 'GLUE CALCULATOR'!$B$4:$C$1062, 2,FALSE)","v":0},0,0,0,0]
["WP004RTP","PRO","EXTRA","Polyforce",2,2,6,{"$f":"VLOOKUP(A336, 'GLUE CALCULATOR'!$B$4:$C$1062, 2,FALSE)","v":0},0,0,0,0]
["WP004LTP","PRO","EXTRA","Polyforce",2,2,6,{"$f":"VLOOKUP(A337, 'GLUE CALCULATOR'!$B$4:$C$1062, 2,FALSE)","v":0},0,0,0,0]
["WP005","PRO","EXTRA","Polyforce",2.7,4,30,{"$f":"VLOOKUP(A338, 'GLUE CALCULATOR'!$B$4:$C$1062, 2,FALSE)","v":0},0,0,0,0]
["WP005R","PRO","EXTRA","Polyforce",2.7,2,6,{"$f":"VLOOKUP(A339, 'GLUE CALCULATOR'!$B$4:$C$1062, 2,FALSE)","v":0},0,0,0,0]
["WP005L","PRO","EXTRA","Polyforce",2.7,2,6,{"$f":"VLOOKUP(A340, 'GLUE CALCULATOR'!$B$4:$C$1062, 2,FALSE)","v":0},0,0,0,0]
["WP005T","PRO","EXTRA","Polyforce",2,4,30,{"$f":"VLOOKUP(A341, 'GLUE CALCULATOR'!$B$4:$C$1062, 2,FALSE)","v":0},0,0,0,0]
["WP005RT","PRO","EXTRA","Polyforce",2,2,6,{"$f":"VLOOKUP(A342, 'GLUE CALCULATOR'!$B$4:$C$1062, 2,FALSE)","v":0},0,0,0,0]
["WP005LT","PRO","EXTRA","Polyforce",2,2,6,{"$f":"VLOOKUP(A343, 'GLUE CALCULATOR'!$B$4:$C$1062, 2,FALSE)","v":0},0,0,0,0]
["WP005P","PRO","EXTRA","Polyforce",2.7,4,30,{"$f":"VLOOKUP(A344, 'GLUE CALCULATOR'!$B$4:$C$1062, 2,FALSE)","v":0},0,0,0,0]
["WP005RP","PRO","EXTRA","Polyforce",2.7,2,6,{"$f":"VLOOKUP(A345, 'GLUE CALCULATOR'!$B$4:$C$1062, 2,FALSE)","v":0},0,0,0,0]
["WP005LP","PRO","EXTRA","Polyforce",2.7,2,6,{"$f":"VLOOKUP(A346, 'GLUE CALCULATOR'!$B$4:$C$1062, 2,FALSE)","v":0},0,0,0,0]
["WP005TP","PRO","EXTRA","Polyforce",2,4,30,{"$f":"VLOOKUP(A347, 'GLUE CALCULATOR'!$B$4:$C$1062, 2,FALSE)","v":0},0,0,0,0]
["WP005RTP","PRO","EXTRA","Polyforce",2,2,6,{"$f":"VLOOKUP(A348, 'GLUE CALCULATOR'!$B$4:$C$1062, 2,FALSE)","v":0},0,0,0,0]
["WP005LTP","PRO","EXTRA","Polyforce",2,2,6,{"$f":"VLOOKUP(A349, 'GLUE CALCULATOR'!$B$4:$C$1062, 2,FALSE)","v":0},0,0,0,0]
["L0101","PRO","EXTRA","Polyforce",2.7,3,16,{"$f":"VLOOKUP(A350, 'GLUE CALCULATOR'!$B$4:$C$1062, 2,FALSE)","v":0},0,0,0,0]
["L0101L","PRO","EXTRA","Polyforce",2.7,2,5,{"$f":"VLOOKUP(A351, 'GLUE CALCULATOR'!$B$4:$C$1062, 2,FALSE)","v":0},0,0,{"$f":"ROUND(H351*(G351/100)*$H$1, 4)","v":0},{"$f":"J351+K351","v":0}]
["L0101R","PRO","EXTRA","Polyforce",2.7,1,3,{"$f":"VLOOKUP(A352, 'GLUE CALCULATOR'!$B$4:$C$1062, 2,FALSE)","v":0},0,0,0,0]
["L0201","PRO","EXTRA","Polyforce",2.7,3,16,{"$f":"VLOOKUP(A353, 'GLUE CALCULATOR'!$B$4:$C$1062, 2,FALSE)","v":0},0,0,0,0]
["L0201L","PRO","EXTRA","Polyforce",2.7,1,4,{"$f":"VLOOKUP(A354, 'GLUE CALCULATOR'!$B$4:$C$1062, 2,FALSE)","v":0},0,0,0,0]
["L0201R","PRO","EXTRA","Polyforce",2.7,2,6,{"$f":"VLOOKUP(A355, 'GLUE CALCULATOR'!$B$4:$C$1062, 2,FALSE)","v":0},0,0,0,0]
["L0301","PRO","EXTRA","Polyforce",2.7,3,22,{"$f":"VLOOKUP(A356, 'GLUE CALCULATOR'!$B$4:$C$1062, 2,FALSE)","v":0},0,0,0,0]
["L0301L","PRO","EXTRA","Polyforce",2.7,2,7,{"$f":"VLOOKUP(A357, 'GLUE CALCULATOR'!$B$4:$C$1062, 2,FALSE)","v":0},0,0,0,0]
["L0301R","PRO","EXTRA","Polyforce",2.7,2,10,{"$f":"VLOOKUP(A358, 'GLUE CALCULATOR'!$B$4:$C$1062, 2,FALSE)","v":0},0,0,0,0]
["L0102","PRO","EXTRA","Polyforce",2.7,3,16,{"$f":"VLOOKUP(A359, 'GLUE CALCULATOR'!$B$4:$C$1062, 2,FALSE)","v":0},0,0,0,0]
["L0102L","PRO","EXTRA","Polyforce",2.7,2,5,{"$f":"VLOOKUP(A360, 'GLUE CALCULATOR'!$B$4:$C$1062, 2,FALSE)","v":0},0,0,0,0]
["L0102R","PRO","EXTRA","Polyforce",2.7,1,3,{"$f":"VLOOKUP(A361, 'GLUE CALCULATOR'!$B$4:$C$1062, 2,FALSE)","v":0},0,0,0,0]
["L0103","PRO","EXTRA","Polyforce",2.7,3,16,{"$f":"VLOOKUP(A362, 'GLUE CALCULATOR'!$B$4:$C$1062, 2,FALSE)","v":0},0,0,0,0]
["L0103L","PRO","EXTRA","Polyforce",2.7,2,5,{"$f":"VLOOKUP(A363, 'GLUE CALCULATOR'!$B$4:$C$1062, 2,FALSE)","v":0},0,0,0,0]
["L0103R","PRO","EXTRA","Polyforce",2.7,1,3,{"$f":"VLOOKUP(A364, 'GLUE CALCULATOR'!$B$4:$C$1062, 2,FALSE)","v":0},0,0,0,0]
["L0104","PRO","EXTRA","Polyforce",2.7,3,16,{"$f":"VLOOKUP(A365, 'GLUE CALCULATOR'!$B$4:$C$1062, 2,FALSE)","v":0},0,0,0,0]
["L0104L","PRO","EXTRA","Polyforce",2.7,2,5,{"$f":"VLOOKUP(A366, 'GLUE CALCULATOR'!$B$4:$C$1062, 2,FALSE)","v":0},0,0,0,0]
["L0104R","PRO","EXTRA","Polyforce",2.7,1,3,{"$f":"VLOOKUP(A367, 'GLUE CALCULATOR'!$B$4:$C$1062, 2,FALSE)","v":0},0,0,0,0]
["L0105","PRO","EXTRA","Polyforce",2.7,3,16,{"$f":"VLOOKUP(A368, 'GLUE CALCULATOR'!$B$4:$C$1062, 2,FALSE)","v":0},0,0,0,0]
["L0105L","PRO","EXTRA","Polyforce",2.7,2,5,{"$f":"VLOOKUP(A369, 'GLUE CALCULATOR'!$B$4:$C$1062, 2,FALSE)","v":0},0,0,0,0]
["L0105R","PRO","EXTRA","Polyforce",2.7,1,3,{"$f":"VLOOKUP(A370, 'GLUE CALCULATOR'!$B$4:$C$1062, 2,FALSE)","v":0},0,0,0,0]
["L0106","PRO","EXTRA","Polyforce",2.7,3,16,{"$f":"VLOOKUP(A371, 'GLUE CALCULATOR'!$B$4:$C$1062, 2,FALSE)","v":0},0,0,0,0]
["L0106L","PRO","EXTRA","Polyforce",2.7,2,5,{"$f":"VLOOKUP(A372, 'GLUE CALCULATOR'!$B$4:$C$1062, 2,FALSE)","v":0},0,0,0,0]
["L0106R","PRO","EXTRA","Polyforce",2.7,1,3,{"$f":"VLOOKUP(A373, 'GLUE CALCULATOR'!$B$4:$C$1062, 2,FALSE)","v":0},0,0,0,0]
["L0101T","PRO","EXTRA","Polyforce",2,3,16,{"$f":"VLOOKUP(A374, 'GLUE CALCULATOR'!$B$4:$C$1062, 2,FALSE)","v":0},0,0,0,0]
["L0101LT","PRO","EXTRA","Polyforce",2,2,5,{"$f":"VLOOKUP(A375, 'GLUE CALCULATOR'!$B$4:$C$1062, 2,FALSE)","v":0},0,0,0,0]
["L0101RT","PRO","EXTRA","Polyforce",2,1,3,{"$f":"VLOOKUP(A376, 'GLUE CALCULATOR'!$B$4:$C$1062, 2,FALSE)","v":0},0,0,0,0]
["L0102T","PRO","EXTRA","Polyforce",2,3,16,{"$f":"VLOOKUP(A377, 'GLUE CALCULATOR'!$B$4:$C$1062, 2,FALSE)","v":0},0,0,0,0]
["L0102LT","PRO","EXTRA","Polyforce",2,2,5,{"$f":"VLOOKUP(A378, 'GLUE CALCULATOR'!$B$4:$C$1062, 2,FALSE)","v":0},0,0,0,0]
["L0102RT","PRO","EXTRA","Polyforce",2,1,3,{"$f":"VLOOKUP(A379, 'GLUE CALCULATOR'!$B$4:$C$1062, 2,FALSE)","v":0},0,0,0,0]
["L0103T","PRO","EXTRA","Polyforce",2,3,16,{"$f":"VLOOKUP(A380, 'GLUE CALCULATOR'!$B$4:$C$1062, 2,FALSE)","v":0},0,0,0,0]
["L0103LT","PRO","EXTRA","Polyforce",2,2,5,{"$f":"VLOOKUP(A381, 'GLUE CALCULATOR'!$B$4:$C$1062, 2,FALSE)","v":0},0,0,0,0]
["L0103RT","PRO","EXTRA","Polyforce",2,1,3,{"$f":"VLOOKUP(A382, 'GLUE CALCULATOR'!$B$4:$C$1062, 2,FALSE)","v":0},0,0,0,0]
["L0104T","PRO","EXTRA","Polyforce",2,3,16,{"$f":"VLOOKUP(A383, 'GLUE CALCULATOR'!$B$4:$C$1062, 2,FALSE)","v":0},0,0,{"$f":"ROUND(H383*(G383/100)*$H$1, 4)","v":0},{"$f":"J383+K383","v":0}]
["L0104LT","PRO","EXTRA","Polyforce",2,2,5,{"$f":"VLOOKUP(A384, 'GLUE CALCULATOR'!$B$4:$C$1062, 2,FALSE)","v":0},0,0,0,0]
["L0104RT","PRO","EXTRA","Polyforce",2,1,3,{"$f":"VLOOKUP(A385, 'GLUE CALCULATOR'!$B$4:$C$1062, 2,FALSE)","v":0},0,0,0,0]
["L0105T","PRO","EXTRA","Polyforce",2,3,16,{"$f":"VLOOKUP(A386, 'GLUE CALCULATOR'!$B$4:$C$1062, 2,FALSE)","v":0},0,0,0,0]
["L0105LT","PRO","EXTRA","Polyforce",2,2,5,{"$f":"VLOOKUP(A387, 'GLUE CALCULATOR'!$B$4:$C$1062, 2,FALSE)","v":0},{"$f":"H387*E387*F387","v":0},{"$f":"ROUND(I387*$H$1, 4)","v":0},0,0]
["L0105RT","PRO","EXTRA","Polyforce",2,1,3,{"$f":"VLOOKUP(A388, 'GLUE CALCULATOR'!$B$4:$C$1062, 2,FALSE)","v":0},0,0,0,0]
["L0106T","PRO","EXTRA","Polyforce",2,3,16,{"$f":"VLOOKUP(A389, 'GLUE CALCULATOR'!$B$4:$C$1062, 2,FALSE)","v":0},0,0,0,0]
["L0106LT","PRO","EXTRA","Polyforce",2,2,5,{"$f":"VLOOKUP(A390, 'GLUE CALCULATOR'!$B$4:$C$1062, 2,FALSE)","v":0},0,0,0,0]
["L0106RT","PRO","EXTRA","Polyforce",2,1,3,{"$f":"VLOOKUP(A391, 'GLUE CALCULATOR'!$B$4:$C$1062, 2,FALSE)","v":0},0,0,0,0]
["L0202","PRO","EXTRA","Polyforce",2.7,3,16,{"$f":"VLOOKUP(A392, 'GLUE CALCULATOR'!$B$4:$C$1062, 2,FALSE)","v":0},0,0,0,0]
["L0202L","PRO","EXTRA","Polyforce",2.7,1,4,{"$f":"VLOOKUP(A393, 'GLUE CALCULATOR'!$B$4:$C$1062, 2,FALSE)","v":0},0,0,0,0]
["L0202R","PRO","EXTRA","Polyforce",2.7,2,6,{"$f":"VLOOKUP(A394, 'GLUE CALCULATOR'!$B$4:$C$1062, 2,FALSE)","v":0},0,0,0,0]
["L0203","PRO","EXTRA","Polyforce",2.7,3,16,{"$f":"VLOOKUP(A395, 'GLUE CALCULATOR'!$B$4:$C$1062, 2,FALSE)","v":0},0,0,0,0]
["L0203L","PRO","EXTRA","Polyforce",2.7,1,4,{"$f":"VLOOKUP(A396, 'GLUE CALCULATOR'!$B$4:$C$1062, 2,FALSE)","v":0},0,0,0,0]
["L0203R","PRO","EXTRA","Polyforce",2.7,2,6,{"$f":"VLOOKUP(A397, 'GLUE CALCULATOR'!$B$4:$C$1062, 2,FALSE)","v":0},0,0,0,0]
["L0204","PRO","EXTRA","Polyforce",2.7,3,16,{"$f":"VLOOKUP(A398, 'GLUE CALCULATOR'!$B$4:$C$1062, 2,FALSE)","v":0},0,0,0,0]
["L0204L","PRO","EXTRA","Polyforce",2.7,1,4,{"$f":"VLOOKUP(A399, 'GLUE CALCULATOR'!$B$4:$C$1062, 2,FALSE)","v":0},0,0,0,0]
["L0204R","PRO","EXTRA","Polyforce",2.7,2,6,{"$f":"VLOOKUP(A400, 'GLUE CALCULATOR'!$B$4:$C$1062, 2,FALSE)","v":0},0,0,0,0]
["L0205","PRO","EXTRA","Polyforce",2.7,3,16,{"$f":"VLOOKUP(A401, 'GLUE CALCULATOR'!$B$4:$C$1062, 2,FALSE)","v":0},0,0,0,0]
["L0205L","PRO","EXTRA","Polyforce",2.7,1,4,{"$f":"VLOOKUP(A402, 'GLUE CALCULATOR'!$B$4:$C$1062, 2,FALSE)","v":0},0,0,0,0]
["L0205R","PRO","EXTRA","Polyforce",2.7,2,6,{"$f":"VLOOKUP(A403, 'GLUE CALCULATOR'!$B$4:$C$1062, 2,FALSE)","v":0},0,0,0,0]
["L0206","PRO","EXTRA","Polyforce",2.7,3,16,{"$f":"VLOOKUP(A404, 'GLUE CALCULATOR'!$B$4:$C$1062, 2,FALSE)","v":0},0,0,0,0]
["L0206L","PRO","EXTRA","Polyforce",2.7,1,4,{"$f":"VLOOKUP(A405, 'GLUE CALCULATOR'!$B$4:$C$1062, 2,FALSE)","v":0},0,0,0,0]
["L0206R","PRO","EXTRA","Polyforce",2.7,2,6,{"$f":"VLOOKUP(A406, 'GLUE CALCULATOR'!$B$4:$C$1062, 2,FALSE)","v":0},0,0,0,0]
["L0201T","PRO","EXTRA","Polyforce",2,3,16,{"$f":"VLOOKUP(A407, 'GLUE CALCULATOR'!$B$4:$C$1062, 2,FALSE)","v":0},0,0,0,0]
["L0201LT","PRO","EXTRA","Polyforce",2,1,4,{"$f":"VLOOKUP(A408, 'GLUE CALCULATOR'!$B$4:$C$1062, 2,FALSE)","v":0},0,0,0,0]
["L0201RT","PRO","EXTRA","Polyforce",2,2,6,{"$f":"VLOOKUP(A409, 'GLUE CALCULATOR'!$B$4:$C$1062, 2,FALSE)","v":0},0,0,0,0]
["L0202T","PRO","EXTRA","Polyforce",2,3,16,{"$f":"VLOOKUP(A410, 'GLUE CALCULATOR'!$B$4:$C$1062, 2,FALSE)","v":0},0,0,0,0]
["L0202LT","PRO","EXTRA","Polyforce",2,1,4,{"$f":"VLOOKUP(A411, 'GLUE CALCULATOR'!$B$4:$C$1062, 2,FALSE)","v":0},0,0,0,0]
["L0202RT","PRO","EXTRA","Polyforce",2,2,6,{"$f":"VLOOKUP(A412, 'GLUE CALCULATOR'!$B$4:$C$1062, 2,FALSE)","v":0},0,0,0,0]
["L0203T","PRO","EXTRA","Polyforce",2,3,16,{"$f":"VLOOKUP(A413, 'GLUE CALCULATOR'!$B$4:$C$1062, 2,FALSE)","v":0},0,0,0,0]
["L0203LT","PRO","EXTRA","Polyforce",2,1,4,{"$f":"VLOOKUP(A414, 'GLUE CALCULATOR'!$B$4:$C$1062, 2,FALSE)","v":0},0,0,0,0]
["L0203RT","PRO","EXTRA","Polyforce",2,2,6,{"$f":"VLOOKUP(A415, 'GLUE CALCULATOR'!$B$4:$C$1062, 2,FALSE)","v":0},0,0,{"$f":"ROUND(H415*(G415/100)*$H$1, 4)","v":0},{"$f":"J415+K415","v":0}]
["L0204T","PRO","EXTRA","Polyforce",2,3,16,{"$f":"VLOOKUP(A416, 'GLUE CALCULATOR'!$B$4:$C$1062, 2,FALSE)","v":0},0,0,0,0]
["L0204LT","PRO","EXTRA","Polyforce",2,1,4,{"$f":"VLOOKUP(A417, 'GLUE CALCULATOR'!$B$4:$C$1062, 2,FALSE)","v":0},0,0,0,0]
["L0204RT","PRO","EXTRA","Polyforce",2,2,6,{"$f":"VLOOKUP(A418, 'GLUE CALCULATOR'!$B$4:$C$1062, 2,FALSE)","v":0},0,0,0,0]
["L0205T","PRO","EXTRA","Polyforce",2,3,16,{"$f":"VLOOKUP(A419, 'GLUE CALCULATOR'!$B$4:$C$1062, 2,FALSE)","v":0},0,0,0,0]
["L0205LT","PRO","EXTRA","Polyforce",2,1,4,{"$f":"VLOOKUP(A420, 'GLUE CALCULATOR'!$B$4:$C$1062, 2,FALSE)","v":0},0,0,0,0]
["L0205RT","PRO","EXTRA","Polyforce",2,2,6,{"$f":"VLOOKUP(A421, 'GLUE CALCULATOR'!$B$4:$C$1062, 2,FALSE)","v":0},0,0,0,0]
["L0206T","PRO","EXTRA","Polyforce",2,3,16,{"$f":"VLOOKUP(A422, 'GLUE CALCULATOR'!$B$4:$C$1062, 2,FALSE)","v":0},0,0,0,0]
["L0206LT","PRO","EXTRA","Polyforce",2,1,4,{"$f":"VLOOKUP(A423, 'GLUE CALCULATOR'!$B$4:$C$1062, 2,FALSE)","v":0},0,0,0,0]
["L0206RT","PRO","EXTRA","Polyforce",2,2,6,{"$f":"VLOOKUP(A424, 'GLUE CALCULATOR'!$B$4:$C$1062, 2,FALSE)","v":0},0,0,0,0]
["L0302","PRO","EXTRA","Polyforce",2.7,3,22,{"$f":"VLOOKUP(A425, 'GLUE CALCULATOR'!$B$4:$C$1062, 2,FALSE)","v":0},0,0,0,0]
["L0302L","PRO","EXTRA","Polyforce",2.7,2,7,{"$f":"VLOOKUP(A426, 'GLUE CALCULATOR'!$B$4:$C$1062, 2,FALSE)","v":0},0,0,0,0]
["L0302R","PRO","EXTRA","Polyforce",2.7,2,10,{"$f":"VLOOKUP(A427, 'GLUE CALCULATOR'!$B$4:$C$1062, 2,FALSE)","v":0},0,0,0,0]
["L0303","PRO","EXTRA","Polyforce",2.7,3,22,{"$f":"VLOOKUP(A428, 'GLUE CALCULATOR'!$B$4:$C$1062, 2,FALSE)","v":0},0,0,0,0]
["L0303L","PRO","EXTRA","Polyforce",2.7,2,7,{"$f":"VLOOKUP(A429, 'GLUE CALCULATOR'!$B$4:$C$1062, 2,FALSE)","v":0},0,0,0,0]
["L0303R","PRO","EXTRA","Polyforce",2.7,2,10,{"$f":"VLOOKUP(A430, 'GLUE CALCULATOR'!$B$4:$C$1062, 2,FALSE)","v":0},0,0,0,0]
["L0304","PRO","EXTRA","Polyforce",2.7,3,22,{"$f":"VLOOKUP(A431, 'GLUE CALCULATOR'!$B$4:$C$1062, 2,FALSE)","v":0},0,0,0,0]
["L0304L","PRO","EXTRA","Polyforce",2.7,2,7,{"$f":"VLOOKUP(A432, 'GLUE CALCULATOR'!$B$4:$C$1062, 2,FALSE)","v":0},0,0,0,0]
["L0304R","PRO","EXTRA","Polyforce",2.7,2,10,{"$f":"VLOOKUP(A433, 'GLUE CALCULATOR'!$B$4:$C$1062, 2,FALSE)","v":0},0,0,0,0]
["L0305","PRO","EXTRA","Polyforce",2.7,3,22,{"$f":"VLOOKUP(A434, 'GLUE CALCULATOR'!$B$4:$C$1062, 2,FALSE)","v":0},0,0,0,0]
["L0305L","PRO","EXTRA","Polyforce",2.7,2,7,{"$f":"VLOOKUP(A435, 'GLUE CALCULATOR'!$B$4:$C$1062, 2,FALSE)","v":0},0,0,0,0]
["L0305R","PRO","EXTRA","Polyforce",2.7,2,10,{"$f":"VLOOKUP(A436, 'GLUE CALCULATOR'!$B$4:$C$1062, 2,FALSE)","v":0},0,0,0,0]
["L0306","PRO","EXTRA","Polyforce",2.7,3,22,{"$f":"VLOOKUP(A437, 'GLUE CALCULATOR'!$B$4:$C$1062, 2,FALSE)","v":0},0,0,0,0]
["L0306L","PRO","EXTRA","Polyforce",2.7,2,7,{"$f":"VLOOKUP(A438, 'GLUE CALCULATOR'!$B$4:$C$1062, 2,FALSE)","v":0},0,0,0,0]
["L0306R","PRO","EXTRA","Polyforce",2.7,2,10,{"$f":"VLOOKUP(A439, 'GLUE CALCULATOR'!$B$4:$C$1062, 2,FALSE)","v":0},0,0,0,0]
["L0301T","PRO","EXTRA","Polyforce",2,3,22,{"$f":"VLOOKUP(A440, 'GLUE CALCULATOR'!$B$4:$C$1062, 2,FALSE)","v":0},0,0,0,0]
["L0301LT","PRO","EXTRA","Polyforce",2,2,7,{"$f":"VLOOKUP(A441, 'GLUE CALCULATOR'!$B$4:$C$1062, 2,FALSE)","v":0},0,0,0,0]
["L0301RT","PRO","EXTRA","Polyforce",2,2,10,{"$f":"VLOOKUP(A442, 'GLUE CALCULATOR'!$B$4:$C$1062, 2,FALSE)","v":0},0,0,0,0]
["L0302T","PRO","EXTRA","Polyforce",2,3,22,{"$f":"VLOOKUP(A443, 'GLUE CALCULATOR'!$B$4:$C$1062, 2,FALSE)","v":0},0,0,0,0]
["L0302LT","PRO","EXTRA","Polyforce",2,2,7,{"$f":"VLOOKUP(A444, 'GLUE CALCULATOR'!$B$4:$C$1062, 2,FALSE)","v":0},0,0,0,0]
["L0302RT","PRO","EXTRA","Polyforce",2,2,10,{"$f":"VLOOKUP(A445, 'GLUE CALCULATOR'!$B$4:$C$1062, 2,FALSE)","v":0},0,0,0,0]
["L0303T","PRO","EXTRA","Polyforce",2,3,22,{"$f":"VLOOKUP(A446, 'GLUE CALCULATOR'!$B$4:$C$1062, 2,FALSE)","v":0},0,0,0,0]
["L0303LT","PRO","EXTRA","Polyforce",2,2,7,{"$f":"VLOOKUP(A447, 'GLUE CALCULATOR'!$B$4:$C$1062, 2,FALSE)","v":0},0,0,{"$f":"ROUND(H447*(G447/100)*$H$1, 4)","v":0},{"$f":"J447+K447","v":0}]
["L0303RT","PRO","EXTRA","Polyforce",2,2,10,{"$f":"VLOOKUP(A448, 'GLUE CALCULATOR'!$B$4:$C$1062, 2,FALSE)","v":0},0,0,0,0]
["L0304T","PRO","EXTRA","Polyforce",2,3,22,{"$f":"VLOOKUP(A449, 'GLUE CALCULATOR'!$B$4:$C$1062, 2,FALSE)","v":0},0,0,0,0]
["L0304LT","PRO","EXTRA","Polyforce",2,2,7,{"$f":"VLOOKUP(A450, 'GLUE CALCULATOR'!$B$4:$C$1062, 2,FALSE)","v":0},0,0,0,0]
["L0304RT","PRO","EXTRA","Polyforce",2,2,10,{"$f":"VLOOKUP(A451, 'GLUE CALCULATOR'!$B$4:$C$1062, 2,FALSE)","v":0},{"$f":"H451*E451*F451","v":0},{"$f":"ROUND(I451*$H$1, 4)","v":0},0,0]
["L0305T","PRO","EXTRA","Polyforce",2,3,22,{"$f":"VLOOKUP(A452, 'GLUE CALCULATOR'!$B$4:$C$1062, 2,FALSE)","v":0},0,0,0,0]
["L0305LT","PRO","EXTRA","Polyforce",2,2,7,{"$f":"VLOOKUP(A453, 'GLUE CALCULATOR'!$B$4:$C$1062, 2,FALSE)","v":0},0,0,0,0]
["L0305RT","PRO","EXTRA","Polyforce",2,2,10,{"$f":"VLOOKUP(A454, 'GLUE CALCULATOR'!$B$4:$C$1062, 2,FALSE)","v":0},0,0,0,0]
["L0306T","PRO","EXTRA","Polyforce",2,3,22,{"$f":"VLOOKUP(A455, 'GLUE CALCULATOR'!$B$4:$C$1062, 2,FALSE)","v":0},0,0,0,0]
["L0306LT","PRO","EXTRA","Polyforce",2,2,7,{"$f":"VLOOKUP(A456, 'GLUE CALCULATOR'!$B$4:$C$1062, 2,FALSE)","v":0},0,0,0,0]
["L0306RT","PRO","EXTRA","Polyforce",2,2,10,{"$f":"VLOOKUP(A457, 'GLUE CALCULATOR'!$B$4:$C$1062, 2,FALSE)","v":0},0,0,0,0]
["L0401","PRO","EXTRA","Polyforce",2.7,3,12.5,{"$f":"VLOOKUP(A458, 'GLUE CALCULATOR'!$B$4:$C$1062, 2,FALSE)","v":0},{"$f":"H458*E458*F458","v":0},{"$f":"ROUND(I458*$H$1, 4)","v":0},{"$f":"ROUND(H458*(G458/100)*$H$1, 4)","v":0},{"$f":"J458+K458","v":0}]
["L0401L","PRO","EXTRA","Polyforce",2.7,2,4,{"$f":"VLOOKUP(A459, 'GLUE CALCULATOR'!$B$4:$C$1062, 2,FALSE)","v":0},0,0,0,0]
["L0401R","PRO","EXTRA","Polyforce",2.7,2,4,{"$f":"VLOOKUP(A460, 'GLUE CALCULATOR'!$B$4:$C$1062, 2,FALSE)","v":0},0,0,0,0]
["L0401T","PRO","EXTRA","Polyforce",2,3,12.5,{"$f":"VLOOKUP(A461, 'GLUE CALCULATOR'!$B$4:$C$1062, 2,FALSE)","v":0},0,0,0,0]
["L0401LT","PRO","EXTRA","Polyforce",2,2,4,{"$f":"VLOOKUP(A462, 'GLUE CALCULATOR'!$B$4:$C$1062, 2,FALSE)","v":0},0,0,0,0]
["L0401RT","PRO","EXTRA","Polyforce",2,2,4,{"$f":"VLOOKUP(A463, 'GLUE CALCULATOR'!$B$4:$C$1062, 2,FALSE)","v":0},0,0,0,0]
["L0101P","PRO","EXTRA","Polyforce",2.7,3,16,{"$f":"VLOOKUP(A464, 'GLUE CALCULATOR'!$B$4:$C$1062, 2,FALSE)","v":0},0,0,0,0]
["L0101LP","PRO","EXTRA","Polyforce",2.7,2,5,{"$f":"VLOOKUP(A465, 'GLUE CALCULATOR'!$B$4:$C$1062, 2,FALSE)","v":0},0,0,0,0]
["L0101RP","PRO","EXTRA","Polyforce",2.7,1,3,{"$f":"VLOOKUP(A466, 'GLUE CALCULATOR'!$B$4:$C$1062, 2,FALSE)","v":0},0,0,0,0]
["L0101TP","PRO","EXTRA","Polyforce",2,3,16,{"$f":"VLOOKUP(A467, 'GLUE CALCULATOR'!$B$4:$C$1062, 2,FALSE)","v":0},0,0,0,0]
["L0101LTP","PRO","EXTRA","Polyforce",2,2,5,{"$f":"VLOOKUP(A468, 'GLUE CALCULATOR'!$B$4:$C$1062, 2,FALSE)","v":0},0,0,0,0]
["L0101RTP","PRO","EXTRA","Polyforce",2,1,3,{"$f":"VLOOKUP(A469, 'GLUE CALCULATOR'!$B$4:$C$1062, 2,FALSE)","v":0},0,0,0,0]
["L0201P","PRO","EXTRA","Polyforce",2.7,3,16,{"$f":"VLOOKUP(A470, 'GLUE CALCULATOR'!$B$4:$C$1062, 2,FALSE)","v":0},0,0,0,0]
["L0201LP","PRO","EXTRA","Polyforce",2.7,1,4,{"$f":"VLOOKUP(A471, 'GLUE CALCULATOR'!$B$4:$C$1062, 2,FALSE)","v":0},0,0,0,0]
["L0201RP","PRO","EXTRA","Polyforce",2.7,2,6,{"$f":"VLOOKUP(A472, 'GLUE CALCULATOR'!$B$4:$C$1062, 2,FALSE)","v":0},0,0,0,0]
["L0201TP","PRO","EXTRA","Polyforce",2,3,16,{"$f":"VLOOKUP(A473, 'GLUE CALCULATOR'!$B$4:$C$1062, 2,FALSE)","v":0},0,0,0,0]
["L0201LTP","PRO","EXTRA","Polyforce",2,1,4,{"$f":"VLOOKUP(A474, 'GLUE CALCULATOR'!$B$4:$C$1062, 2,FALSE)","v":0},0,0,0,0]
["L0201RTP","PRO","EXTRA","Polyforce",2,2,6,{"$f":"VLOOKUP(A475, 'GLUE CALCULATOR'!$B$4:$C$1062, 2,FALSE)","v":0},0,0,0,0]
["L0301P","PRO","EXTRA","Polyforce",2.7,3,22,{"$f":"VLOOKUP(A476, 'GLUE CALCULATOR'!$B$4:$C$1062, 2,FALSE)","v":0},0,0,0,0]
["L0301LP","PRO","EXTRA","Polyforce",2.7,2,7,{"$f":"VLOOKUP(A477, 'GLUE CALCULATOR'!$B$4:$C$1062, 2,FALSE)","v":0},0,0,0,0]
["L0301RP","PRO","EXTRA","Polyforce",2.7,2,10,{"$f":"VLOOKUP(A478, 'GLUE CALCULATOR'!$B$4:$C$1062, 2,FALSE)","v":0},0,0,0,0]
["L0301TP","PRO","EXTRA","Polyforce",2,3,22,{"$f":"VLOOKUP(A479, 'GLUE CALCULATOR'!$B$4:$C$1062, 2,FALSE)","v":0},0,0,0,0]
["L0301LTP","PRO","EXTRA","Polyforce",2,2,7,{"$f":"VLOOKUP(A480, 'GLUE CALCULATOR'!$B$4:$C$1062, 2,FALSE)","v":0},0,0,0,0]
["L0301RTP","PRO","EXTRA","Polyforce",2,2,10,{"$f":"VLOOKUP(A481, 'GLUE CALCULATOR'!$B$4:$C$1062, 2,FALSE)","v":0},0,0,0,0]
["L0401P","PRO","EXTRA","Polyforce",2.7,3,12.5,{"$f":"VLOOKUP(A482, 'GLUE CALCULATOR'!$B$4:$C$1062, 2,FALSE)","v":0},{"$f":"H482*E482*F482","v":0},{"$f":"ROUND(I482*$H$1, 4)","v":0},{"$f":"ROUND(H482*(G482/100)*$H$1, 4)","v":0},{"$f":"J482+K482","v":0}]
["L0401LP","PRO","EXTRA","Polyforce",2.7,2,4,{"$f":"VLOOKUP(A483, 'GLUE CALCULATOR'!$B$4:$C$1062, 2,FALSE)","v":0},0,0,0,0]
["L0401RP","PRO","EXTRA","Polyforce",2.7,2,4,{"$f":"VLOOKUP(A484, 'GLUE CALCULATOR'!$B$4:$C$1062, 2,FALSE)","v":0},0,0,0,0]
["L0401TP","PRO","EXTRA","Polyforce",2,3,12.5,{"$f":"VLOOKUP(A485, 'GLUE CALCULATOR'!$B$4:$C$1062, 2,FALSE)","v":0},0,0,0,0]
["L0401LTP","PRO","EXTRA","Polyforce",2,2,4,{"$f":"VLOOKUP(A486, 'GLUE CALCULATOR'!$B$4:$C$1062, 2,FALSE)","v":0},0,0,0,0]
["L0401RTP","PRO","EXTRA","Polyforce",2,2,4,{"$f":"VLOOKUP(A487, 'GLUE CALCULATOR'!$B$4:$C$1062, 2,FALSE)","v":0},0,0,0,0]

{"sheet":"User Instructions","index":2,"n_rows":11,"n_cols":1,"rows_kept":11,"cut":false,"hidden":false,"merged":[]}
["Kalkulačka lepidel – návod k použití"]
[]
["Kalkulačka slouží k přesnému výpočtu množství lepidla potřebného pro instalaci lineárních produktů, jako jsou nástěnné panely, soklové lišty, stěnové lišty, garnýžové profily, stropní lišty, osvětlovací profily apod."]
[]
["Vyplňovat lze pouze zelená pole, ostatní buňky jsou uzamčené. Do příslušných zelených polí zadejte požadovaný počet instalovaných profilů."]
[]
["V horní části kalkulačky se zobrazí výsledky, tedy potřebný počet kartuší lepidel Fix Pro, Fix Extra a MAX."]
[]
["V posledním sloupci s názvem „Typy montážních lepidel“ najdete doporučení, kdy použít lepidla Mardom Fix Pro nebo MAX."]
[]
["Pro vymazání zadaných hodnot v zelených polích stačí kliknout na tlačítko „Smazat obsah buněk“."]